program: Gaussian 09
title: 000096576
version: EM64L-G09RevD.01
frameworkgroup: C1[X(C19H21NO2)]
method: RPBEPBE
basis: SDD
operation: Freq
keyword: #p
keyword: freq=noraman
keyword: PBEPBE/SDD
title: #p freq=noraman PBEPBE/SDD
converged: YES YES NO NO
title: Mulliken charges:
elementType: O O N C C C C C C C C C C C C C C C C C C C H H H H H H H H H H H H H H H H H H H H H
charge: -0.412158 -0.237150 -0.076429 0.140516 -0.467478 -0.474196 -0.410519 -0.423958 0.424491 0.108166 -0.477541 -0.359162 -0.401063 0.450879 -0.261968 -0.248164 -0.239613 -0.448812 -0.380433 -0.222038 -0.229647 -0.246411 0.229101 0.224759 0.226741 0.211562 0.213647 0.234003 0.212228 0.192943 0.193690 0.219843 0.253721 0.251774 0.226776 0.224928 0.377198 0.231683 0.264304 0.229672 0.223832 0.223784 0.226500
chargesum: 0.00000
title: Mulliken charges with hydrogens summed into heavy atoms:
elementType: O O N C C C C C C C C C C C C C C C C C C C
charge: -0.034961 -0.237150 -0.076429 0.140516 -0.013618 -0.035893 0.037131 -0.018787 0.424491 0.108166 -0.064008 -0.105441 -0.149289 0.450879 -0.035192 -0.023236 -0.009941 -0.217129 -0.116129 0.001794 -0.005863 -0.019910
polarizability: 2.59419436e+02 -1.75750552e+01 1.91722980e+02 1.91156603e+01 -3.87015783e+00 1.73892611e+02
1716.lowfreq: -12.1172 -2.2793 -0.0006 -0.0005 0.0003 3.0207 24.9756 28.3505 36.2369
frequency: 24.9429 28.3171 36.2025 47.9962 61.7129 83.8816 95.1496 124.3639 171.0638 189.7498 200.9572 234.5319 249.1667 286.2488 313.6509 324.7940 341.6059 357.0517 386.5645 403.0218 405.5587 444.6684 462.0108 495.2854 507.8357 527.6215 560.7683 588.9940 602.7533 616.6985 617.2784 640.1063 680.7231 703.8351 704.8599 708.6910 738.2716 765.9857 779.7083 808.3480 818.1567 853.4260 859.6737 869.7883 911.4128 913.8023 932.2829 945.9001 978.3032 982.3167 989.7712 990.5786 994.5716 996.0641 996.7625 1007.6310 1021.9845 1026.5674 1031.9871 1038.7464 1063.2351 1076.9853 1085.7072 1116.7986 1136.5401 1142.5904 1167.4103 1169.6005 1174.6604 1180.0813 1185.5916 1191.1032 1200.6928 1211.2634 1229.1717 1255.9788 1274.1105 1291.4864 1309.9679 1314.0833 1321.8140 1328.8393 1339.3528 1351.3096 1362.0814 1378.7931 1381.1956 1396.5876 1434.0234 1440.2420 1443.2973 1456.1188 1458.8833 1474.3092 1481.1469 1483.3109 1483.8572 1590.0298 1594.2129 1608.9263 1614.7818 1637.2334 2833.0147 2844.0055 2860.5322 2983.2594 3003.2373 3012.9286 3024.3415 3044.5457 3079.2795 3083.0179 3111.5458 3121.9076 3123.1948 3130.8134 3134.9787 3143.7886 3146.4083 3158.2795 3160.7660 3170.4817 3507.8718
redmass: 4.6411 4.1340 4.1573 4.5932 9.6647 4.9050 4.6702 4.7844 3.2484 3.6909 5.1199 4.8469 3.9537 2.6658 2.2321 2.7085 3.8680 4.1783 2.0438 2.8287 2.8475 3.0615 3.2179 3.3564 3.5592 3.6542 2.8499 2.1289 3.0358 6.2818 5.8575 2.2536 4.1865 2.3244 2.1800 2.6566 1.6359 2.1391 2.5737 3.8434 1.5749 1.2542 1.2497 2.7650 1.7546 1.6628 2.0226 1.9589 1.3989 1.3856 5.2696 5.0725 1.9381 1.7363 1.3988 1.7280 1.9205 2.0730 2.2700 2.5452 2.2640 1.6023 1.6893 2.3414 3.3031 2.3695 1.9555 1.0793 1.0686 1.1142 1.3700 2.4529 1.1562 2.5053 1.3904 1.4039 1.4808 1.5078 1.7012 1.3741 1.3659 1.3967 1.3436 1.4858 1.4509 5.1039 3.7269 1.8411 2.1471 2.0910 1.1145 1.1004 1.1197 1.0989 1.3658 1.5857 2.0549 5.9453 6.1725 5.9731 6.1397 8.6973 1.0709 1.0716 1.0699 1.0863 1.0637 1.0623 1.0846 1.0877 1.1010 1.1016 1.0869 1.0862 1.0847 1.0881 1.0915 1.0936 1.0954 1.0967 1.1014 1.0975 1.0639
irintensity: 0.0337 0.1830 0.0683 0.1694 1.4322 0.3686 0.4087 0.1864 1.0769 2.1512 0.3097 0.1153 3.6428 0.3701 2.3412 7.2688 2.4697 0.2820 2.4369 0.0790 0.2202 1.9978 9.8472 2.8187 11.9134 16.4740 20.2648 57.9448 24.1632 0.6017 3.1037 66.0241 9.1947 53.2826 30.5186 23.8953 56.8340 48.1482 10.2031 2.8773 0.1149 0.1106 0.2815 4.6617 6.2782 0.3792 7.8278 0.6726 0.2497 1.3449 1.2457 1.0841 45.0069 13.5330 5.2892 53.1308 34.5218 3.1526 15.0875 165.1887 16.1762 13.2928 5.8151 32.6595 17.9849 11.0900 4.3053 0.2530 0.4841 2.0955 1.5279 2.9624 2.9195 2.4135 4.9863 0.2863 18.3912 20.4581 6.5351 20.3099 0.2233 2.0084 23.6869 2.9002 5.7333 0.3185 5.2391 1.8030 13.0683 11.4992 5.1477 15.9624 10.9977 4.7284 9.3889 21.7875 18.6214 2.2141 0.9443 19.5034 7.2967 160.7737 43.1747 79.1191 125.5144 20.5141 14.5422 20.0483 49.4396 25.6954 14.9472 17.7807 8.6777 0.1968 1.5353 4.3032 19.9566 22.8509 33.2017 35.7392 28.1403 12.0250 26.5710
temp: 298.150 k
press: 1.00000 atm
elementType: 8 8 7 6 6 6 6 6 6 6 6 6 6 6 6 6 6 6 6 6 6 6 1 1 1 1 1 1 1 1 1 1 1 1 1 1 1 1 1 1 1 1 1
symmnumber: 1
zpe: 933065.1 jmol-1
zpe.correction: 0.355386 hartree
zpe.thermalcorrener: 0.374645 hartree
zpe.thermalcorrenthalpy: 0.375589 hartree
zpe.thermalcorrgfe: 0.305944 hartree
zpe.sumelectzpe: -940.220101 hartree
zpe.sumelectthermal: -940.200842 hartree
zpe.sumelectthermalent: -940.199897 hartree
zpe.sumelectthermalfe: -940.269543 hartree
dipole: 0.6275 0.4342 1.2278
dipole: 1.4456
quadrupole: -121.9624 -121.0175 -130.6770
quadrupole: -3.2761 4.4717 2.3632
quadrupole: 2.5899 3.5348 -6.1247 -3.2761 4.4717 2.3632
hfenergy: -940.5754867 hartree
pointgroup: C01 [X(C19H21N1O2)]
dipole: -0.2383129 -0.2164492 0.4688523 debye
polarizability: 258.0216787|-16.1686967|191.1147321|-22.7223352|6.2253541|175.8986163 unknown
InChI: InChI=1S/C19H21NO2/c21-18(22)19(17-9-5-2-6-10-17)11-13-20(14-12-19)15-16-7-3-1-4-8-16/h1-10,21H,11-15H2
charge 0 multiplicity 1
43 atoms
O  -2.545486 -2.681409 0.09256
O  -1.912994 -1.84179 -1.965776
N  1.312415 -0.668351 0.595107
C  -1.612566 -0.416132 0.06224
C  -0.5268 0.373314 -0.734211
C  -1.021802 -0.779013 1.451985
C  0.826359 -0.361001 -0.773409
C  0.332783 -1.501935 1.330885
C  -2.918758 0.421311 0.152161
C  -1.999736 -1.683168 -0.726774
C  2.670373 -1.260482 0.594857
C  -3.553866 0.845892 -1.046258
C  -3.501212 0.787779 1.390581
C  3.758878 -0.271916 0.184796
C  -4.730105 1.623442 -1.006658
C  -4.678165 1.570233 1.43159
C  -5.297394 1.99354 0.234989
C  4.870024 -0.702247 -0.5809
C  3.701765 1.080448 0.607531
C  5.911654 0.195561 -0.91108
C  4.737606 1.980815 0.275455
C  5.849084 1.541331 -0.482793
H  -0.398144 1.354059 -0.240138
H  -0.867633 0.55122 -1.768278
H  -1.725424 -1.410498 2.020847
H  -0.856979 0.161327 2.011059
H  0.726754 -1.293926 -1.385612
H  1.573904 0.278974 -1.274468
H  0.730644 -1.698982 2.34418
H  0.183284 -2.498984 0.838346
H  2.733322 -2.16727 -0.060751
H  2.871891 -1.607523 1.62911
H  -3.135021 0.554156 -2.016526
H  -3.046681 0.46605 2.331706
H  -5.20439 1.937878 -1.943132
H  -5.111209 1.845589 2.400028
H  -2.844938 -3.437788 -0.482013
H  4.919692 -1.744021 -0.923082
H  2.830185 1.408889 1.184784
H  -6.210289 2.598597 0.268247
H  6.764644 -0.152401 -1.504997
H  4.680519 3.024223 0.607019
H  6.653213 2.24011 -0.740109
