program: Gaussian 09
title: 000096551
version: EM64L-G09RevD.01
frameworkgroup: C1[X(C15H15NO2)]
method: RPBEPBE
basis: SDD
operation: Freq
keyword: #p
keyword: freq=noraman
keyword: PBEPBE/SDD
title: #p freq=noraman PBEPBE/SDD
converged: YES YES NO NO
title: Mulliken charges:
elementType: O O N C C C C C C C C C C C C C C C H H H H H H H H H H H H H H H
charge: -0.479974 -0.290130 -0.612731 0.012217 -0.654488 0.386015 0.394127 -0.406506 -0.400048 -0.376338 -0.391280 0.301637 -0.248567 -0.223543 -0.225535 -0.240520 -0.241605 -0.242212 0.228602 0.285176 0.222362 0.290178 0.278195 0.252928 0.372525 0.222082 0.224001 0.225253 0.222609 0.227130 0.225939 0.321383 0.341120
chargesum: 0.00000
title: Mulliken charges with hydrogens summed into heavy atoms:
elementType: O O N C C C C C C C C C C C C C C C
charge: -0.107450 -0.290130 0.049772 0.012217 -0.140711 0.386015 0.394127 -0.184143 -0.109870 -0.098143 -0.138352 0.301637 -0.026485 0.000458 -0.000282 -0.017911 -0.014475 -0.016273
polarizability: 1.93939540e+02 -1.28909772e+01 1.48918017e+02 1.03097742e+01 -5.76640566e+00 1.54120171e+02
1716.lowfreq: -12.3335 -7.6736 -0.0004 0.0003 0.0007 4.3728 25.0710 32.0003 60.0114
frequency: 24.8072 31.7942 60.0044 62.2200 73.5853 97.1084 197.3580 216.6157 236.2396 251.7348 280.8452 328.4565 347.7856 360.1475 402.2280 405.3612 451.1944 482.5449 493.4299 530.4008 536.2973 566.0473 605.1740 615.9727 616.8912 646.3405 676.4329 703.7632 706.9261 727.6478 734.4545 761.8872 771.3771 841.0654 853.4135 860.3732 868.1253 912.0655 933.4103 941.6799 976.0080 983.9462 989.8775 990.1741 997.5640 1000.5059 1004.4659 1024.6687 1028.1404 1040.7574 1062.5512 1080.3687 1097.8396 1158.4936 1169.0667 1171.6695 1176.3629 1189.0431 1190.5203 1241.3222 1273.4100 1310.6356 1315.8569 1374.6737 1378.5839 1379.1877 1403.6857 1432.3326 1434.6192 1439.8707 1478.7560 1479.4792 1583.3927 1589.9626 1591.6419 1608.4920 1612.5429 1633.5281 3004.7645 3064.1240 3117.1435 3119.9425 3127.7781 3129.0577 3139.8635 3141.6229 3155.4101 3157.6970 3168.1873 3175.6838 3262.2772 3515.2735 3671.2055
redmass: 3.9894 3.8464 4.9744 4.4723 7.1153 4.5036 5.1278 3.8848 4.6763 5.7056 4.8516 5.6487 3.1072 5.2479 2.8289 2.8807 4.1711 2.3574 1.8862 1.7947 2.3526 2.9797 3.0876 6.3076 6.3543 2.2487 3.1935 1.6768 1.8105 1.1509 3.5863 1.8185 2.2716 3.3637 1.2523 1.2688 2.7844 1.7680 1.4635 2.4491 1.3785 1.3989 5.7510 5.6837 1.3641 1.4338 2.5756 2.8004 2.1487 2.6643 1.8657 1.5831 1.7926 1.9078 1.1343 1.0903 1.5100 1.2244 1.2250 2.0191 1.4431 1.3525 1.3400 3.5475 6.7235 6.3013 1.5781 2.1526 1.7831 1.2714 2.2297 2.2154 2.0644 4.9185 6.2996 6.0479 6.0031 2.1040 1.0599 1.1008 1.0845 1.0844 1.0874 1.0883 1.0932 1.0939 1.0965 1.0988 1.0986 1.0954 1.0664 1.0453 1.1041
irintensity: 0.1025 1.2339 6.1191 1.0521 2.0614 4.2255 5.8754 2.9773 4.5545 3.5388 0.7972 1.8863 4.0519 7.2780 0.0818 0.1230 2.3716 1.7254 13.3916 114.9868 52.1411 26.3274 65.6177 2.6730 1.2659 48.9071 27.8512 54.9082 51.3046 198.8289 11.4877 50.8650 34.2671 4.3471 0.3951 0.9053 3.8289 13.6359 7.5364 6.7826 0.2264 0.6246 0.2141 0.3417 2.0573 9.3542 29.6058 8.1038 14.2908 6.8505 6.2730 1.6755 7.6891 14.0047 6.5942 0.9958 22.7350 7.9724 3.2927 37.0315 27.4674 1.1739 0.3337 191.1499 6.6044 20.8963 74.1336 2.2296 30.8231 45.6581 22.1726 15.5068 43.4461 6.0701 0.2282 9.7831 0.7130 237.5642 9.4686 11.0791 7.7387 0.7620 3.6064 8.1544 36.7100 34.0476 24.6338 29.9937 13.7330 10.1556 253.4923 41.8186 27.2640
temp: 298.150 k
press: 1.00000 atm
elementType: 8 8 7 6 6 6 6 6 6 6 6 6 6 6 6 6 6 6 1 1 1 1 1 1 1 1 1 1 1 1 1 1 1
symmnumber: 1
zpe: 694176.4 jmol-1
zpe.correction: 0.264398 hartree
zpe.thermalcorrener: 0.280102 hartree
zpe.thermalcorrenthalpy: 0.281047 hartree
zpe.thermalcorrgfe: 0.219878 hartree
zpe.sumelectzpe: -784.527591 hartree
zpe.sumelectthermal: -784.511886 hartree
zpe.sumelectthermalent: -784.510942 hartree
zpe.sumelectthermalfe: -784.572110 hartree
dipole: -1.0531 -1.1684 -4.8967
dipole: 5.1432
quadrupole: -98.3805 -97.6939 -98.9127
quadrupole: 1.0016 9.0280 9.4160
quadrupole: -0.0515 0.6351 -0.5836 1.0016 9.0280 9.4160
hfenergy: -784.7919886 hartree
pointgroup: C01 [X(C15H15N1O2)]
dipole: -0.3204296 0.9183003 1.7744074 debye
polarizability: 192.2170351|10.0024189|146.6007616|-15.1617741|-4.4719725|158.1599317 unknown
InChI: InChI=1S/C15H15NO2/c16-14(17)11-15(18,12-7-3-1-4-8-12)13-9-5-2-6-10-13/h1-10,18H,11,16H2
charge 0 multiplicity 1
33 atoms
O  -0.092405 0.599623 -1.997526
O  -2.273166 2.098235 -1.403332
N  -2.382918 3.121586 0.665248
C  0.029016 0.496937 -0.535819
C  -0.310351 1.902902 0.071245
C  -0.899507 -0.620926 -0.009688
C  1.511892 0.19098 -0.231754
C  -1.522189 -0.578728 1.262743
C  2.502594 0.484448 -1.200474
C  -1.10517 -1.760642 -0.82847
C  1.909476 -0.325547 1.02673
C  -1.727157 2.366559 -0.281709
C  -2.338444 -1.645757 1.704908
C  3.869101 0.266516 -0.913009
C  -1.915548 -2.828014 -0.388478
C  3.276031 -0.537035 1.315765
C  -2.537645 -2.775625 0.881619
C  4.262551 -0.239609 0.347185
H  -0.138228 1.920315 1.162003
H  0.40331 2.617307 -0.381735
H  -1.383337 0.285045 1.923185
H  2.180885 0.860351 -2.175485
H  -0.630794 -1.783756 -1.814384
H  1.152706 -0.591264 1.77349
H  -0.993302 1.019514 -2.165437
H  -2.817297 -1.592715 2.689551
H  4.625895 0.489095 -1.67415
H  -2.065558 -3.699633 -1.03575
H  3.56921 -0.943269 2.290686
H  -3.170549 -3.602758 1.222483
H  5.322412 -0.409044 0.569077
H  -1.964568 3.338976 1.56769
H  -3.31615 3.473835 0.448991
