program: Gaussian 09
title: 000096509
version: EM64L-G09RevD.01
frameworkgroup: C1[X(C10H14O)]
method: RPBEPBE
basis: SDD
operation: Freq
keyword: #pfreq=noraman
keyword: PBEPBE/SDD
title: #p freq=noraman PBEPBE/SDD
converged: NO YES NO NO
title: Mulliken charges:
elementType: O C C C C C C C C C C H H H H H H H H H H H H H H
charge: -0.184016 -0.092508 -0.140582 -0.195724 -0.301014 -0.523192 -0.509507 -0.489901 -0.543217 -0.418101 0.118273 0.234324 0.257313 0.247703 0.275091 0.238932 0.230145 0.212142 0.225816 0.230333 0.213719 0.239827 0.251162 0.218620 0.204361
chargesum: 0.00000
title: Mulliken charges with hydrogens summed into heavy atoms:
elementType: O C C C C C C C C C C
charge: -0.184016 0.141816 0.116731 0.051979 -0.025923 -0.054115 -0.071548 -0.045849 -0.052228 0.004880 0.118273
polarizability: 1.15274388e+02 5.68817891e-01 9.60137018e+01 1.78218517e+00 -2.67673579e-01 8.48298847e+01
1716.lowfreq: -10.6425 -0.0008 -0.0008 -0.0006 16.4832 31.6370 100.6492 147.8112 184.1746
frequency: 100.4882 147.7589 184.1525 278.7228 304.4675 361.3082 414.5304 482.8702 509.3047 531.1772 578.1940 637.0542 682.9409 748.0855 781.8273 797.0491 845.7411 850.3289 892.4089 906.0411 909.9013 919.6173 944.3509 950.2565 984.1016 1007.5882 1014.1977 1035.8544 1051.4199 1052.9608 1094.3795 1121.8433 1134.0990 1154.8734 1161.3615 1166.6948 1184.5348 1212.8414 1219.9819 1240.4593 1268.8647 1272.2979 1280.3200 1281.6320 1287.8967 1305.1193 1309.8241 1318.5104 1329.5105 1428.3137 1470.0127 1471.5892 1478.0571 1496.2265 1665.7971 2980.9858 2986.7649 2989.0546 2994.1083 3001.0560 3017.4014 3022.6699 3052.1569 3056.0209 3059.7270 3064.7717 3069.1492 3083.6151 3095.0791
redmass: 4.6058 3.0840 2.3578 2.9514 2.0063 2.5899 4.1609 2.4382 3.5927 2.3258 2.3589 2.9691 2.8327 3.8627 3.0875 3.3102 2.3311 1.9657 1.5450 2.5925 2.5783 2.2446 1.9810 2.0986 1.9054 1.6493 1.4921 1.6421 1.7291 1.5606 1.2549 1.8581 1.5246 2.1037 1.5167 1.6978 1.8544 1.5629 1.5161 1.5494 1.3383 1.3526 1.5102 1.4853 1.3256 1.3061 1.5262 1.3346 1.5442 1.0850 1.0844 1.0872 1.1005 1.0898 11.8256 1.0639 1.0616 1.0655 1.0620 1.0855 1.0613 1.0864 1.0978 1.1003 1.0997 1.0899 1.1033 1.1048 1.0910
irintensity: 4.2439 0.9407 0.5588 0.2094 0.3629 0.3920 4.4502 4.3797 2.6178 1.0920 1.3012 0.6742 1.6516 3.9661 4.3877 6.9049 2.0282 2.9163 0.4652 1.2421 2.8880 4.5529 2.0166 21.5175 3.8397 2.3963 14.0988 2.0225 4.2903 2.1239 0.9120 2.6014 14.1249 21.0668 3.2493 7.7861 2.4452 0.9017 5.7100 2.3326 0.1914 2.7195 2.8184 1.4848 3.4898 0.4291 2.2272 2.2376 1.1056 18.5241 3.3110 7.8161 9.2164 20.0295 242.2504 31.3292 30.1058 36.8940 18.4473 9.3407 39.9351 15.9108 37.8690 40.3829 12.0895 50.4925 82.1506 30.5980 13.6581
temp: 298.150 k
press: 1.00000 atm
elementType: 8 6 6 6 6 6 6 6 6 6 6 1 1 1 1 1 1 1 1 1 1 1 1 1 1
symmnumber: 1
zpe: 572606.3 jmol-1
zpe.correction: 0.218094 hartree
zpe.thermalcorrener: 0.226707 hartree
zpe.thermalcorrenthalpy: 0.227652 hartree
zpe.thermalcorrgfe: 0.184768 hartree
zpe.sumelectzpe: -463.840359 hartree
zpe.sumelectthermal: -463.831746 hartree
zpe.sumelectthermalent: -463.830802 hartree
zpe.sumelectthermalfe: -463.873685 hartree
dipole: 3.0336 1.9072 0.8869
dipole: 3.6914
quadrupole: -76.6834 -67.0519 -64.6918
quadrupole: -7.1410 -3.3860 -1.3405
quadrupole: -7.2077 2.4238 4.7839 -7.1410 -3.3860 -1.3405
hfenergy: -464.0584531 hartree
pointgroup: C01 [X(C10H14O1)]
dipole: -1.1953773 0.7468543 -0.3500257 debye
dipolederiv: -0.8770498 0.2838055 -0.1780324 0.3412991 -0.6383112 0.0613277 -0.2894712 0.0797265 -0.3933339 0.0308704 -0.0386883 0.0029841 -0.0222558 -0.0351166 0.0041167 -0.0051769 0.0468072 0.1269046 0.0751961 0.0328423 0.0103863 -0.0407805 0.040918 -0.0510279 -0.1522882 -0.0882421 0.0706209 0.0680217 -0.0174435 0.0112854 -0.0220119 0.1588195 -0.0218894 -0.0187243 -0.0609581 0.0372983 -0.4369537 -0.0281827 -0.1657452 -0.0771207 0.0229968 0.0049464 -0.1210307 0.0278894 -0.0180269 0.0851878 0.018286 -0.0341608 -0.0325737 -0.0132014 -0.0546457 -0.0093512 -0.0150259 -0.0083231 -0.0054118 -0.0357879 -0.0447502 -0.0359593 0.0257883 0.0304073 0.0130027 -0.0318452 0.1305068 0.0029075 0.0335019 -0.016506 0.0442043 0.0628723 -0.0709773 0.0734295 0.0077258 0.1201184 0.0058702 0.0215561 -0.0461874 0.0544005 -0.4396484 -0.0809481 -0.0508448 -0.0956559 0.077504 0.0250105 -0.0080359 0.0465084 -0.0061107 0.0303241 -0.0242645 -0.0496784 -0.0356233 0.1636189 1.0631465 -0.2745569 0.3779552 -0.2075088 0.8933225 0.097745 0.5704636 0.0612646 0.2938911 0.0088515 -0.0043657 -0.03394 -0.0080125 0.0279419 -0.0336797 -0.0162685 -0.0619301 -0.1726827 0.012266 0.0117603 -0.0310762 0.0115818 -0.0183721 0.0717924 -0.027557 0.1003796 -0.0932899 0.0371721 0.0547186 -0.0096733 0.0368924 -0.1748014 0.0285172 -0.0003844 0.039082 0.0629588 0.0606533 0.0212514 0.007714 0.0305133 -0.0910478 -0.0826692 0.0069171 -0.0759685 0.0201929 -0.061906 -0.0528262 0.155602 -0.0436122 0.0490976 0.0487669 0.1020744 0.038282 -0.0294891 -0.0871498 0.0048963 -0.1511886 0.0037982 0.0613961 -0.0104042 -0.1201 -0.014045 0.0143738 0.0538179 -0.0287606 0.0192499 -0.022772 0.0209838 0.0570385 -0.0267304 0.1073878 -0.1386447 -0.0070173 0.0731353 0.0478768 0.0932181 -0.079309 -0.0890775 0.0848909 -0.1157594 0.0067894 0.0306476 -0.0293231 0.0026716 -0.0587917 -0.1811393 0.0203702 0.0187084 0.0548576 0.0718837 0.0413657 0.0145349 0.0335554 0.0253103 0.0715249 0.0403032 0.0059545 -0.0203705 -0.1657145 0.0771658 0.0390316 -0.0062169 0.008029 0.0783594 -0.0112147 -0.0514478 -0.0531026 -0.1081234 -0.072325 -0.063818 0.0515524 -0.0504853 0.0425057 0.0242438 0.0921108 0.0623852 0.063863 -0.1880094 -0.0260257 -0.078774 -0.0045274 0.0650524 -0.0036925 -0.1366116 -0.0145283 0.0258408 0.0576721 -0.0015056 0.0289098 -0.0167245 0.019044 0.0449154 0.1081134 0.0572674 -0.1587372 unknown
polarizability: 115.2582748|-0.485247|96.0033775|1.9522561|0.3607177|84.8563224 unknown
InChI: InChI=1S/C10H14O/c11-10-5-6-4-9(10)8-3-1-2-7(6)8/h6-9H,1-5H2
charge 0 multiplicity 1
25 atoms
O  2.889445 -1.08829 0.576859
C  -0.720676 0.714176 0.639548
C  -0.4701 -0.822328 0.327825
C  0.378248 1.429068 -0.209029
C  0.740414 -0.794341 -0.676963
C  0.462225 0.516317 -1.473695
C  -2.19389 0.992486 0.223153
C  -1.80402 -1.360838 -0.269196
C  1.758096 1.145202 0.449685
C  -2.887443 -0.394417 0.277731
C  1.949861 -0.365469 0.16844
H  -0.582667 0.933835 1.714775
H  -0.209926 -1.390779 1.239191
H  0.178613 2.496431 -0.397362
H  0.893804 -1.731412 -1.232197
H  1.28383 0.795797 -2.157388
H  -0.477868 0.475439 -2.049604
H  -2.229955 1.384512 -0.813075
H  -2.681409 1.740632 0.873336
H  -1.98764 -2.414957 0.004398
H  -1.781371 -1.306255 -1.375457
H  1.80931 1.359111 1.532599
H  2.576816 1.711623 -0.03641
H  -3.828419 -0.431008 -0.300892
H  -3.129676 -0.654637 1.326927
