program: Gaussian 09
title: 000096517
version: EM64L-G09RevD.01
frameworkgroup: C1[X(C5H9N5O4S2)]
method: RPBEPBE
basis: SDD
operation: Freq
keyword: #p
keyword: freq=noraman
keyword: PBEPBE/SDD
title: #p freq=noraman PBEPBE/SDD
converged: YES YES NO NO
title: Mulliken charges:
elementType: S S O O O O N N N N N C C C C C H H H H H H H H H
charge: 0.923964 0.941376 -0.544568 -0.542276 -0.538806 -0.544954 -0.012754 0.024422 -0.697560 -0.624846 -0.611875 -0.292812 -0.287583 0.282929 0.289102 -0.739433 0.263821 0.284788 0.283795 0.330596 0.352924 0.344462 0.383479 0.354445 0.377365
chargesum: 0.00000
title: Mulliken charges with hydrogens summed into heavy atoms:
elementType: S S O O O O N N N N N C C C C C
charge: 0.923964 0.941376 -0.544568 -0.542276 -0.538806 -0.544954 -0.012754 0.024422 -0.014041 0.103095 0.119935 -0.292812 -0.287583 0.282929 0.289102 0.092971
polarizability: 2.24005667e+02 4.82059451e+00 1.69451206e+02 -5.96564132e-01 -1.80702934e+00 1.06826908e+02
1716.lowfreq: -5.2862 -3.7289 -0.0016 0.0012 0.0015 7.2657 17.7024 42.8300 48.3749
frequency: 17.4219 42.7595 48.3525 96.5893 106.4719 114.5594 143.5804 155.6268 173.6473 196.3081 202.8118 215.7858 232.1542 241.8248 268.9484 284.6156 303.3229 314.8393 330.2447 352.7630 367.6652 397.5827 452.7852 462.2912 498.5035 528.4822 570.3064 580.2069 583.1923 604.4852 639.6838 669.8570 732.0067 737.3796 761.8819 770.9427 791.0271 801.4273 871.0588 881.4452 894.5311 923.1458 970.6780 996.3209 1016.3498 1033.5730 1055.0858 1163.5050 1269.6527 1294.5250 1307.8350 1413.2799 1415.9450 1450.4239 1487.5184 1509.9988 1536.7101 1562.6518 1619.0987 1628.4226 3032.7505 3180.5134 3191.7417 3362.8796 3374.7906 3388.1453 3544.2158 3622.3830 3627.1190
redmass: 5.9492 7.6513 6.1591 6.5971 2.8523 2.5882 1.1402 5.0359 3.2117 6.8410 8.8457 5.4378 4.2936 6.3333 4.8464 8.5784 3.8623 6.6377 7.5766 4.1967 4.8873 9.2608 5.0633 4.2593 7.4894 3.9559 7.2575 4.4789 1.2572 1.2720 7.3212 4.3261 1.2587 1.2041 9.1617 2.8810 2.6276 12.7412 6.6478 5.8595 2.9985 9.6611 1.3929 3.7371 1.9717 1.9843 1.3568 2.4498 3.6879 1.2426 3.7242 1.0535 1.0592 4.8056 6.7334 2.2804 1.1273 2.0265 1.9853 1.8114 1.0243 1.1074 1.1077 1.0585 1.0418 1.0568 1.1011 1.0953 1.0932
irintensity: 2.7507 1.7716 1.3004 2.4008 19.4288 8.2283 0.5242 2.0625 7.2568 3.9814 0.6730 4.7231 3.7267 1.4093 18.1519 17.3063 13.4443 2.2445 30.6671 11.3759 11.1884 18.7186 99.9340 170.6736 11.6606 1.3841 46.8368 7.4400 41.3238 102.9915 46.6359 0.7230 158.5382 75.4816 67.1576 148.4449 156.4108 73.3644 34.4535 84.0047 31.9552 3.9281 59.1267 6.4976 55.9522 11.4395 30.0755 0.1002 93.8543 23.3256 39.1346 10.6712 22.4318 295.2363 39.3502 23.3173 20.5583 67.9314 592.4507 456.6801 0.7818 0.9529 0.3672 110.2007 40.3687 172.4930 29.8235 124.1695 97.8787
temp: 298.150 k
press: 1.00000 atm
elementType: 16 16 8 8 8 8 7 7 7 7 7 6 6 6 6 6 1 1 1 1 1 1 1 1 1
symmnumber: 1
zpe: 433159.6 jmol-1
zpe.correction: 0.164982 hartree
zpe.thermalcorrener: 0.183169 hartree
zpe.thermalcorrenthalpy: 0.184113 hartree
zpe.thermalcorrgfe: 0.118045 hartree
zpe.sumelectzpe: -1565.156704 hartree
zpe.sumelectthermal: -1565.138518 hartree
zpe.sumelectthermalent: -1565.137573 hartree
zpe.sumelectthermalfe: -1565.203641 hartree
dipole: -5.5326 3.3885 5.2907
dipole: 8.3716
quadrupole: -130.9935 -98.1431 -111.3588
quadrupole: 14.7328 -1.7858 5.9571
quadrupole: -17.4950 15.3554 2.1396 14.7328 -1.7858 5.9571
hfenergy: -1565.3216863 hartree
pointgroup: C01 [X(C5H9N5O4S2)]
dipole: -2.145062 1.4694775 2.0217051 debye
dipolederiv: 1.93516 -0.0066372 -0.2648701 -0.0069299 1.1464292 -0.005939 -0.414961 -0.0014154 1.6845209 1.8283827 -0.056564 -0.0136931 -0.025141 1.1761121 0.0539279 0.1046529 0.0295299 1.2627857 -0.7871383 0.0461283 0.033158 0.1410455 -0.7029726 0.2059941 0.0571401 0.0512153 -0.5913908 -0.7950511 -0.0587241 0.029907 -0.1272272 -0.6255131 -0.145556 0.0681525 -0.018557 -0.5261696 -0.7345081 0.0689176 -0.027036 0.1557827 -0.5937218 -0.0011922 -0.1473891 0.1152591 -0.5302106 -0.7563249 0.0002389 0.0409303 -0.0949062 -0.485336 0.0671496 0.127071 -0.0303915 -0.6683093 -1.3850833 0.4722843 -0.0751267 0.288491 -0.9060724 0.0815895 -0.1150566 0.1350862 -0.1644072 -1.3654275 -0.5612852 0.0083634 -0.3608075 -0.8833351 0.0154423 -0.0299099 -0.0444976 -0.153608 -0.7506804 0.0557549 0.0983928 -0.0125734 -0.3734762 0.0477897 0.277418 0.0841863 -0.8638775 -0.5280695 0.3817213 -0.003513 0.3031758 -1.1930498 0.0963297 -0.011062 -0.0195721 -0.5741747 -0.5623461 -0.4580675 0.0635537 -0.3442224 -1.1391415 -0.0163098 0.0421669 0.076844 -0.5524523 -0.3190256 -0.0263408 -0.0189114 -0.0348342 -0.9819357 0.0565435 -0.1012681 0.050828 -0.2629999 1.2939576 0.0884897 0.075607 0.119241 1.0356836 -0.0815723 0.1334599 -0.0727736 -0.1576402 0.7249306 -0.4493657 0.0689884 0.0743915 1.4845628 -0.2041155 -0.0038517 -0.1803078 0.2477689 0.7380369 0.5376304 0.006699 0.0111479 1.4876086 0.0060013 0.0095135 -0.0135002 0.2426759 -0.2304118 0.0044506 -0.0010953 -0.0522832 -0.2289642 -0.0810435 -0.0420417 -0.0843328 -0.1637179 0.0972882 -0.0254904 0.0392603 -0.0403195 0.036777 -0.008031 0.0455584 0.0038769 -0.0384083 -0.025689 -0.0192001 0.0008641 -0.0396481 0.0985791 -0.0236303 -0.0221276 -0.0258035 0.0911883 0.1175697 0.0530706 -0.0311111 0.0673919 0.0028959 0.0028991 -0.0300099 -0.0013957 0.0567048 0.2402184 -0.0153225 0.1010338 -0.0374727 0.0940193 0.0285764 0.040676 -0.0052975 0.1659391 0.1479291 -0.0487215 -0.0019569 0.0141756 0.256332 -0.1101288 0.0526105 -0.0588123 0.1451751 0.164517 -0.0158862 -0.0033522 -0.0335339 0.330984 0.0027304 -0.0073322 0.0263874 0.3502115 0.3989425 0.0583537 -0.0603313 0.0244849 0.3134083 -0.0208875 -0.010689 0.0287205 0.3273701 0.1761679 0.0058969 -0.0160733 0.0374583 0.3451446 0.0043038 -0.0214574 -0.0114862 0.3579775 0.3766551 -0.0313322 -0.0496874 -0.026887 0.304982 0.0291287 -0.0012638 -0.0337904 0.3150485 unknown
polarizability: 223.9303358|4.7362998|168.9248231|-2.8645975|-6.1392201|107.4286216 unknown
InChI: InChI=1S/C5H9N5O4S2/c1-15(11,12)5-9-3(6)2(4(7)10-5)16(8,13)14/h6-8H2,1H3
charge 0 multiplicity 1
25 atoms
S  -3.107552 0.1019 0.055919
S  3.369823 -0.098106 -0.036973
O  -3.639561 1.558629 -0.478388
O  -3.754515 -1.282842 -0.531584
O  3.860897 -1.470568 0.687495
O  3.869656 0.291974 -1.541794
N  0.889928 1.182261 -0.187787
N  0.799529 -1.237667 0.021821
N  -3.395387 -0.061097 1.851542
N  -1.035116 2.499244 -0.392518
N  -1.217598 -2.417047 -0.004327
C  -1.254007 0.052552 -0.088341
C  1.391803 -0.049931 -0.045396
C  -0.496106 1.260986 -0.22698
C  -0.588021 -1.215232 -0.021643
C  3.781578 1.378589 1.111193
H  3.438935 1.102021 2.117596
H  4.874699 1.47532 1.053629
H  3.25314 2.248031 0.700087
H  -3.396308 0.863792 2.310076
H  -4.265826 -0.59994 1.992093
H  -0.390264 3.280164 -0.505999
H  -2.04988 2.599402 -0.538862
H  -0.632211 -3.249747 0.059698
H  -2.231236 -2.474088 -0.170957
