program: Gaussian 09
title: 000096515
version: EM64L-G09RevD.01
frameworkgroup: C1[X(C14H22N4O2S)]
method: RPBEPBE
basis: SDD
operation: Freq
keyword: #p
keyword: freq=noraman
keyword: PBEPBE/SDD
title: #p freq=noraman PBEPBE/SDD
converged: NO YES NO NO
title: Mulliken charges:
elementType: S O O N N N N C C C C C C C C C C C C C C H H H H H H H H H H H H H H H H H H H H H H
charge: 0.245310 -0.269157 -0.269224 -0.165014 -0.370904 -0.218714 -0.039668 -0.373126 -0.366325 -0.353354 -0.352735 -0.654860 -0.355282 0.105707 0.105864 -0.168398 0.134540 0.212469 -0.694741 -0.614822 -0.598447 0.197625 0.196683 0.192403 0.190666 0.214327 0.216008 0.189406 0.188671 0.288379 0.284516 0.195336 0.196035 0.342144 0.210323 0.210183 0.217295 0.244539 0.273836 0.244457 0.268427 0.249754 0.249866
chargesum: 0.00000
title: Mulliken charges with hydrogens summed into heavy atoms:
elementType: S O O N N N N C C C C C C C C C C C C C C
charge: 0.245310 -0.269157 -0.269224 -0.165014 -0.028760 -0.218714 -0.039668 0.021183 0.016744 0.076981 0.025341 -0.081965 0.036089 0.105707 0.105864 -0.168398 0.134540 0.212469 -0.056940 0.148011 0.169600
polarizability: 3.26508230e+02 5.99312361e+00 2.07760600e+02 2.43922960e+00 -8.20008129e-01 1.19048487e+02
1716.lowfreq: -4.7548 -3.6870 -0.0020 -0.0015 -0.0010 6.2956 9.0326 22.0379 32.3622
frequency: 8.7901 22.0356 32.0881 44.1973 69.3876 72.0518 77.2880 86.6159 96.0550 112.6316 116.7600 122.0362 126.7403 140.7237 142.9728 159.1118 183.1492 214.6488 228.5895 242.0994 284.9623 305.5551 309.0863 339.4505 358.0760 371.2805 380.6917 404.2785 422.1339 464.8731 480.7364 491.2316 587.3606 628.9228 632.7078 667.7011 679.0624 693.3821 703.1582 724.9186 735.2540 738.6736 759.9208 765.4318 818.0943 889.0370 902.1229 925.8961 936.4507 968.2404 988.6847 997.3984 1022.8031 1038.0691 1051.2981 1071.5513 1074.0503 1081.5726 1102.2025 1118.1428 1128.9126 1131.8792 1167.6510 1187.4368 1193.5653 1218.5058 1225.6048 1227.7585 1253.5502 1261.4876 1264.3030 1282.1801 1286.4687 1291.9482 1294.1316 1295.0115 1323.3836 1334.4583 1351.3544 1355.1529 1372.1216 1391.1360 1393.9285 1418.8409 1429.5266 1445.7523 1463.8292 1464.1897 1469.8073 1473.6484 1473.8479 1476.4193 1477.4639 1478.0998 1479.7804 1484.2363 1489.5836 1511.3293 1577.9682 1616.4951 1658.6952 2953.3239 2956.7955 2964.0825 2969.7839 2973.2231 2981.6746 2989.2090 3001.5427 3005.9032 3011.8701 3017.2873 3033.4266 3043.5875 3048.8880 3069.3605 3072.7684 3094.9748 3104.1665 3123.8181 3137.6347 3138.0863 3590.1943
redmass: 5.1088 4.2071 2.4681 2.4801 4.4359 1.7728 3.8040 1.0814 2.6669 3.1754 2.8607 1.4719 1.8877 5.4682 2.1675 4.1731 4.6643 8.8907 1.1230 4.1849 3.7712 6.1934 3.3185 3.7304 7.2815 7.4296 5.7362 5.9873 4.2985 3.5100 6.7693 8.6349 6.6842 7.8488 1.3608 8.3676 5.0939 6.8548 11.1951 1.0637 1.0865 10.8624 1.1277 4.9169 1.1954 1.8881 1.2173 4.8749 5.6229 3.8444 1.1758 4.4651 3.3838 3.2630 3.2194 1.1731 2.1215 2.3371 4.0421 2.5327 1.3039 1.2972 1.8777 1.7500 3.3063 1.2539 1.4021 2.7423 1.2640 5.8689 1.2472 1.0345 6.6419 1.1565 1.2639 1.1211 6.9592 1.4906 1.5398 1.6622 4.8985 1.2171 2.9423 1.3290 1.2911 1.0903 1.0697 1.0726 1.0728 1.0437 1.2047 1.0684 1.0494 1.0702 1.0428 1.0848 1.0933 3.2388 8.3090 10.5162 10.4766 1.0589 1.0589 1.0591 1.0591 1.0364 1.0590 1.0974 1.1002 1.0336 1.0327 1.1030 1.1044 1.0573 1.1045 1.1007 1.0993 1.1026 1.1022 1.1092 1.1025 1.1010 1.0820
irintensity: 0.0798 0.1609 0.5731 0.0381 0.0712 0.5007 0.1917 0.0426 0.4083 1.7640 1.3422 1.5722 0.0025 2.2899 0.1860 0.1181 17.7722 1.9809 0.0252 6.3583 0.1822 0.1098 5.1819 8.2819 0.8981 22.5444 0.1196 22.2429 3.0200 3.9263 21.9357 3.9232 3.7324 0.0803 96.8180 11.5604 18.6360 18.2844 4.9613 13.7636 0.7554 14.1427 6.0900 0.5562 0.0276 5.0564 1.5566 3.6923 10.3896 40.6766 0.1695 3.0748 0.2933 39.1359 5.0612 1.3008 1.8149 0.2975 34.2759 16.9975 0.2586 0.1861 19.4293 0.0317 68.5982 2.7964 0.3462 3.0674 17.4086 30.8872 0.2357 0.3835 22.1404 2.9601 23.8531 6.9399 74.9278 13.8167 6.9321 2.6239 3.3033 10.5768 427.5755 193.3882 69.5616 13.6023 0.6506 0.5496 1.5777 18.1778 2.2532 4.4522 10.6955 6.0083 17.4404 1.7691 27.1485 144.1095 13.0061 531.6192 568.2146 0.3235 3.4338 3.7021 101.9809 39.0677 51.4233 0.0737 0.0710 34.1432 31.6673 0.1581 25.0821 9.2804 96.6380 95.0567 54.6334 18.9982 17.8584 15.1984 0.8144 0.4228 92.3025
temp: 298.150 k
press: 1.00000 atm
elementType: 16 8 8 7 7 7 7 6 6 6 6 6 6 6 6 6 6 6 6 6 6 1 1 1 1 1 1 1 1 1 1 1 1 1 1 1 1 1 1 1 1 1 1
symmnumber: 1
zpe: 924805.9 jmol-1
zpe.correction: 0.352240 hartree
zpe.thermalcorrener: 0.375750 hartree
zpe.thermalcorrenthalpy: 0.376694 hartree
zpe.thermalcorrgfe: 0.295250 hartree
zpe.sumelectzpe: -1312.639192 hartree
zpe.sumelectthermal: -1312.615682 hartree
zpe.sumelectthermalent: -1312.614738 hartree
zpe.sumelectthermalfe: -1312.696182 hartree
dipole: -5.5720 -0.1803 -0.0145
dipole: 5.5749
quadrupole: -147.4909 -140.5528 -133.2723
quadrupole: -1.3264 -0.2528 -0.1029
quadrupole: -7.0523 -0.1141 7.1664 -1.3264 -0.2528 -0.1029
hfenergy: -1312.9914319 hartree
pointgroup: C01 [X(C14H22N4O2S1)]
dipole: -2.1923697 0.0652822 0.0051024 debye
polarizability: 326.5387044|-5.7042294|207.7112571|-2.3840183|-1.5398542|119.0673546 unknown
InChI: InChI=1S/C14H22N4O2S/c1-4-5-6-7-8-9-21-13-15-10-11(16-13)17(2)14(20)18(3)12(10)19/h15H,4-9H2,1-3H3
charge 0 multiplicity 1
43 atoms
S  -0.960199 2.136587 0.05836
O  4.922444 2.176318 -0.123563
O  4.917115 -2.546516 0.03531
N  2.833785 -1.464944 0.063863
N  1.823751 1.940033 -0.022893
N  4.895954 -0.203102 -0.042518
N  0.773808 -0.082847 0.076064
C  -4.587837 -0.04128 -0.004711
C  -6.057923 0.432596 0.055112
C  -3.582972 1.135353 0.068288
C  -7.075975 -0.724491 -0.056859
C  -2.133248 0.632686 0.025274
C  -8.545306 -0.248904 0.010247
C  2.832929 0.965031 -0.017546
C  2.153184 -0.258473 0.042521
C  0.610883 1.269445 0.035531
C  4.261437 1.093159 -0.065468
C  4.252445 -1.470973 0.022405
C  -9.55925 -1.405787 -0.119264
C  2.100685 -2.743293 0.13133
C  6.375871 -0.243676 -0.089698
H  -4.394904 -0.747388 0.828971
H  -4.423276 -0.609498 -0.943249
H  -6.228647 0.981033 1.004784
H  -6.241503 1.16072 -0.762458
H  -3.770786 1.826225 -0.777402
H  -3.756576 1.709124 0.999832
H  -6.892151 -1.459002 0.755107
H  -6.911552 -1.268292 -1.010591
H  -1.873547 0.008184 0.894164
H  -1.906092 0.074301 -0.896626
H  -8.724342 0.492899 -0.794877
H  -8.711691 0.286164 0.967479
H  1.982241 2.946436 -0.065683
H  -9.423339 -2.145906 0.691941
H  -9.432734 -1.937181 -1.081399
H  -10.60093 -1.039141 -0.070345
H  1.49044 -2.782059 1.04931
H  2.845678 -3.551984 0.136378
H  1.434389 -2.844727 -0.741736
H  6.728594 0.79699 -0.136661
H  6.710924 -0.806992 -0.975863
H  6.769624 -0.746429 0.808638
