program: Gaussian 09
title: 000096506
version: EM64L-G09RevD.01
frameworkgroup: C1[X(C15H10O7)]
method: RPBEPBE
basis: SDD
operation: Freq
keyword: #pfreq=noraman
keyword: PBEPBE/SDD
title: #p freq=noraman PBEPBE/SDD
converged: YES YES NO NO
title: Mulliken charges:
elementType: O O O O O O O C C C C C C C C C C C C C C C H H H H H H H H H H
charge: -0.262677 -0.446109 -0.405684 -0.465326 -0.460510 -0.348503 -0.417396 0.254511 0.088303 0.260617 0.013516 0.238687 -0.074624 -0.436365 0.339918 -0.002280 0.047529 -0.349355 -0.332116 -0.398371 -0.344604 0.286743 0.250048 0.229950 0.290567 0.227327 0.259266 0.396068 0.389831 0.404937 0.405077 0.361022
chargesum: 0.00000
title: Mulliken charges with hydrogens summed into heavy atoms:
elementType: O O O O O O O C C C C C C C C C C C C C C C
charge: -0.262677 -0.050041 -0.015853 -0.060390 -0.055433 -0.348503 -0.056373 0.254511 0.088303 0.260617 0.013516 0.238687 -0.074624 -0.186317 0.339918 -0.002280 0.047529 -0.119405 -0.041549 -0.171043 -0.085338 0.286743
polarizability: 3.78849693e+02 9.18692480e+00 2.21887791e+02 -1.21417598e-01 2.61599271e-01 7.15393693e+01
1716.lowfreq: -0.0011 -0.0008 -0.0006 2.3547 6.6957 6.8191 30.6067 38.4939 77.3701
frequency: 30.4231 38.4590 77.3687 95.5642 105.6161 148.5737 170.4000 184.8397 212.3912 219.8720 220.5068 244.3947 268.4612 315.8053 325.8129 333.8195 347.9769 387.0554 388.7913 389.8503 409.6209 422.4872 429.1156 441.1499 455.6867 457.5452 479.2987 502.3902 520.4778 553.0035 567.8791 606.2637 633.3591 634.2372 643.0177 654.0228 705.4161 733.7237 735.6521 804.2350 805.6142 808.7276 844.9571 856.5488 856.9202 894.5482 942.1877 942.5594 958.6926 991.1944 998.1483 1018.2802 1046.4829 1098.4940 1113.3554 1146.1736 1174.9418 1187.6496 1225.9274 1237.8677 1248.3408 1259.6021 1262.6381 1293.4112 1318.2410 1326.4242 1374.9772 1389.4977 1408.6691 1434.2923 1448.6313 1464.0115 1501.3768 1511.9954 1552.2853 1585.4680 1593.4516 1627.7797 1628.4097 1675.9527 2638.3739 3121.9850 3159.3465 3166.1249 3185.1871 3194.2609 3531.2894 3544.2793 3558.6556 3577.0805
redmass: 3.7642 8.5734 7.2850 7.7692 8.1268 8.9588 9.2237 6.5427 6.7339 8.6479 7.2626 5.4591 5.5742 6.7526 6.0958 7.7102 8.0753 1.1602 6.3926 8.6140 2.7417 5.9306 1.1061 1.1425 8.3520 1.1009 9.6094 2.8688 10.7792 9.6372 7.5043 6.4991 5.4144 6.8860 8.5731 7.8973 3.5103 5.6159 4.0914 6.4097 1.8767 3.1108 1.6719 5.7553 1.6383 6.9051 5.3890 1.4493 1.0605 1.3442 3.5350 2.9744 5.1044 3.4875 1.5940 1.3073 1.7610 1.1416 2.2673 1.8629 2.0289 1.8576 2.3943 3.2611 2.6382 1.5948 2.7299 3.9770 6.9871 4.2733 5.1550 6.1186 2.8773 4.8074 5.0837 5.8973 5.8731 5.9148 6.4580 6.3069 1.0716 1.0895 1.0948 1.0888 1.0974 1.0915 1.0653 1.0653 1.0656 1.0661
irintensity: 1.4903 0.8249 0.5473 0.5943 0.8813 0.0969 0.1525 1.2389 6.0557 2.0915 9.6496 2.3205 10.5543 1.0936 19.2551 12.5290 5.5311 136.6807 3.1916 0.1729 6.6964 14.4926 231.9138 213.7979 17.5813 42.0509 4.0122 26.7228 3.4176 36.3524 2.0136 3.1976 7.7009 3.7490 13.0618 3.1854 0.6733 60.5523 0.8760 41.9329 17.2427 4.0614 82.2667 20.0345 11.4854 78.6173 136.9409 9.2074 142.5671 0.3719 44.3852 50.0627 119.2709 4.7926 113.3518 358.3156 0.5410 83.1661 68.4412 327.3512 115.2486 333.7287 35.2628 79.0727 186.5662 59.7360 431.9592 33.7598 502.0160 38.8496 8.4652 137.8583 158.4303 129.4748 6.2088 21.2539 438.7046 35.2923 85.8217 127.9723 430.7382 19.5214 7.3317 1.8823 4.1416 3.0374 86.9894 106.3744 165.6677 89.4475
temp: 298.150 k
press: 1.00000 atm
elementType: 8 8 8 8 8 8 8 6 6 6 6 6 6 6 6 6 6 6 6 6 6 6 1 1 1 1 1 1 1 1 1 1
symmnumber: 1
zpe: 583932.4 jmol-1
zpe.correction: 0.222408 hartree
zpe.thermalcorrener: 0.240861 hartree
zpe.thermalcorrenthalpy: 0.241805 hartree
zpe.thermalcorrgfe: 0.176232 hartree
zpe.sumelectzpe: -1102.618500 hartree
zpe.sumelectthermal: -1102.600047 hartree
zpe.sumelectthermalent: -1102.599103 hartree
zpe.sumelectthermalfe: -1102.664676 hartree
dipole: -2.6546 -0.7527 0.0203
dipole: 2.7593
quadrupole: -89.0700 -128.8983 -130.1557
quadrupole: -21.9935 -0.1390 0.1294
quadrupole: 26.9713 -12.8570 -14.1144 -21.9935 -0.1390 0.1294
hfenergy: -1102.8409076 hartree
pointgroup: C01 [X(C15H10O7)]
dipole: 1.0429822 -0.3007282 -0.0164234 debye
polarizability: 378.7200034|-10.1439211|221.3361389|2.7421475|9.8217371|72.2207109 unknown
InChI: InChI=1S/C15H10O7/c16-7-3-1-6(2-4-7)9-5-8(17)10-11(18)12(19)13(20)14(21)15(10)22-9/h1-5,16,18-21H
charge 0 multiplicity 1
32 atoms
O  0.272735 -0.560342 -0.02845
O  -3.801066 2.188391 0.121954
O  -1.295419 -2.862992 -0.20564
O  -5.336406 -0.177648 -0.060261
O  -4.048256 -2.648923 -0.220015
O  -1.466124 3.232443 0.220675
O  6.601542 -0.869589 0.034808
C  -1.734572 0.853317 0.049623
C  -1.125459 -0.430772 -0.033486
C  1.080648 0.579028 0.060587
C  -3.152617 0.965386 0.042745
C  -0.908269 2.054305 0.14314
C  -1.898651 -1.60475 -0.123781
C  0.523425 1.847531 0.144354
C  2.511737 0.234091 0.053714
C  -3.933711 -0.199816 -0.047032
C  -3.309864 -1.462393 -0.128951
C  3.513615 1.241378 0.119849
C  2.922815 -1.129744 -0.018927
C  4.878072 0.905118 0.115188
C  4.282875 -1.475117 -0.023942
C  5.26456 -0.457888 0.043532
H  1.162068 2.729024 0.216283
H  3.235676 2.298304 0.174431
H  2.1606 -1.911485 -0.070766
H  5.63684 1.696175 0.166355
H  4.604944 -2.518603 -0.07933
H  -3.038131 2.903241 0.180393
H  -2.009081 -3.551709 -0.260738
H  -5.642558 0.764621 0.002154
H  -5.018271 -2.442337 -0.216851
H  7.218304 -0.097045 0.084485
