program: Gaussian 09
title: 000010714
version: EM64L-G09RevD.01
frameworkgroup: C1[X(C10H12O2)]
method: RPBEPBE
basis: SDD
operation: Freq
keyword: #pfreq=noraman
keyword: PBEPBE/SDD
title: #p freq=noraman PBEPBE/SDD
converged: YES YES NO NO
title: Mulliken charges:
elementType: O O C C C C C C C C C C H H H H H H H H H H H H
charge: -0.449722 -0.259310 0.357364 0.367227 0.378665 0.115521 -0.631618 -0.539064 -0.812734 -0.814286 -0.788066 0.088585 0.238293 0.281593 0.233885 0.229580 0.229229 0.225597 0.225724 0.236446 0.212093 0.247186 0.247087 0.380722
chargesum: 0.00000
title: Mulliken charges with hydrogens summed into heavy atoms:
elementType: O O C C C C C C C C C C
charge: -0.069000 -0.259310 0.357364 0.367227 0.378665 0.115521 -0.393324 -0.257471 -0.120040 -0.126518 -0.081700 0.088585
polarizability: 1.65377654e+02 -2.07285736e+00 1.27838653e+02 2.42852024e-02 6.18712612e-03 6.02872762e+01
1716.lowfreq: -0.0009 0.0003 0.0007 7.2698 15.0220 16.3072 49.5986 86.3316 116.1818
frequency: 49.5142 86.2805 116.1788 137.8967 169.9828 180.7330 193.7962 242.4123 291.0758 304.8545 334.9074 351.4530 388.5529 445.9569 466.3888 539.0774 552.5833 577.5833 602.8523 665.5156 704.9135 725.7887 764.0234 794.8240 889.1686 928.5094 970.7830 987.7930 1004.1290 1030.3070 1032.0025 1045.1683 1055.7318 1086.0387 1171.7684 1206.3672 1261.0488 1286.4811 1312.8414 1373.3983 1380.7255 1395.0766 1405.9356 1407.5966 1454.6479 1461.6909 1461.8793 1473.1405 1476.5658 1480.5424 1503.0526 1564.0338 1623.2615 1636.4282 2970.5175 2972.0073 2990.7643 3041.3944 3045.5075 3075.1213 3086.7248 3089.1037 3090.3966 3118.3196 3163.9247 3529.0329
redmass: 8.3991 3.5782 1.0364 2.1347 1.0427 1.2385 5.1599 3.0038 2.5115 3.1200 3.4646 5.2195 5.3788 2.6687 4.7859 3.5803 1.9542 3.9718 1.6496 4.4216 3.7987 5.9376 4.0278 3.5102 1.2814 1.3879 4.8763 1.4913 1.4674 1.6477 1.4684 1.5807 1.6683 2.3666 2.1270 2.1451 3.0923 1.2662 3.4613 3.9941 4.4239 1.2967 1.1952 1.2915 1.0452 1.0507 1.0937 1.1926 1.0454 1.1634 3.0381 6.7657 6.5940 7.6013 1.0376 1.0385 1.0364 1.0968 1.0965 1.0959 1.0985 1.0979 1.1012 1.0912 1.0916 1.0640
irintensity: 0.6749 0.0164 0.1962 4.8046 0.2619 0.0202 0.2813 0.1381 0.2611 3.7420 0.0570 2.1281 2.2871 21.0173 3.2885 22.1871 29.4424 12.7485 101.4262 15.8672 20.4902 0.1568 8.2379 0.7871 7.9724 6.1122 197.2907 1.4550 22.2720 3.3320 11.4306 17.8438 0.1093 183.4191 38.8066 1.1356 1.1943 3.6283 88.3643 20.7578 7.7215 3.4875 2.2925 30.1497 11.0260 1.1183 1.1881 29.1603 32.1907 13.2809 30.5212 55.2689 40.4114 297.5872 56.8993 8.8062 19.9272 41.0479 0.0856 10.3150 32.6781 3.4263 24.2221 24.6795 1.6563 42.1120
temp: 298.150 k
press: 1.00000 atm
elementType: 8 8 6 6 6 6 6 6 6 6 6 6 1 1 1 1 1 1 1 1 1 1 1 1
symmnumber: 1
zpe: 509765.1 jmol-1
zpe.correction: 0.194159 hartree
zpe.thermalcorrener: 0.206404 hartree
zpe.thermalcorrenthalpy: 0.207348 hartree
zpe.thermalcorrgfe: 0.156057 hartree
zpe.sumelectzpe: -537.850781 hartree
zpe.sumelectthermal: -537.838536 hartree
zpe.sumelectthermalent: -537.837592 hartree
zpe.sumelectthermalfe: -537.888883 hartree
dipole: 2.7514 -0.5390 0.0033
dipole: 2.8037
quadrupole: -67.5507 -65.0958 -73.3301
quadrupole: 5.0663 -0.0029 0.0040
quadrupole: 1.1082 3.5630 -4.6712 5.0663 -0.0029 0.0040
hfenergy: -538.04494 hartree
pointgroup: C01 [X(C10H12O2)]
dipole: 1.0798489 0.2235024 -0.0273446 debye
dipolederiv: -0.4390209 0.2917694 -0.0089265 0.4958934 -1.2558546 0.0174416 -0.0156992 0.0213828 -0.4278975 -1.1740835 -0.1986415 0.0218613 -0.1439781 -0.6832494 0.014409 0.019402 0.0152885 -0.3153884 0.4631174 -0.0904287 -0.0064488 -0.1452689 0.1125441 -0.0010315 -0.0059284 -0.0016775 -0.0119345 -0.0714272 0.3719762 -0.0110671 0.4078425 0.0050034 -0.0094832 -0.0121161 -0.00906 -0.0623747 0.326945 0.2786404 -0.0144141 -0.0917542 0.2385225 -0.0055539 -0.0029117 -0.012268 0.0041779 -0.8290137 0.2114293 0.0082026 0.1316598 -0.1677516 0.0024109 0.0106026 0.0009772 -0.0182839 -0.4111963 -0.2074489 0.0102635 -0.1585409 0.0206912 -0.0033987 0.0088164 -0.0024492 -0.1911333 0.1856844 -0.2467019 0.0016599 0.1099978 -0.076731 -0.0034284 -0.0091955 0.0028779 -0.1306233 -0.230479 0.0500657 0.0038587 -0.0458839 0.0875834 -0.0003695 0.0088864 -0.002517 0.0534478 -0.0588955 -0.1322193 0.0062551 -0.0753247 -0.0050169 0.0035718 0.0051144 0.0047076 0.0697207 -0.07989 -0.2569624 0.0098623 -0.1123426 -0.0061207 0.0029322 0.0053288 0.0052227 0.0259136 1.9225055 -0.2315521 -0.0234988 -0.3909135 1.5293482 -0.0351415 -0.0177194 -0.0379356 0.2123559 0.0521133 0.052495 0.0000126 0.0636216 -0.1131481 0.0065348 -0.0003014 0.0069036 0.142908 0.1244443 0.0090335 0.0001798 0.0181582 -0.0308472 0.0049516 -0.0000574 0.0051254 0.1485271 0.0771927 -0.0246848 0.0014754 0.0953157 -0.1451462 0.007291 -0.0030158 0.0093331 0.1092441 -0.0187045 -0.0043553 0.0620109 -0.018946 0.0692448 0.0930767 0.1190436 0.0575098 -0.0481826 -0.025282 -0.0115416 -0.0619782 -0.0314654 0.0580357 -0.0996719 -0.1185375 -0.0644772 -0.0300226 -0.0342677 -0.0538798 -0.1070519 -0.0205744 0.0600926 0.0428674 -0.1380787 -0.017873 -0.0429356 -0.0245034 -0.0473756 0.1091301 -0.0150533 0.0582862 -0.047886 0.1382795 0.0140172 -0.0510253 0.0424132 0.1481747 -0.0027905 0.0265717 -0.0961953 0.0052063 0.0004799 0.0029775 0.1102238 0.0217785 0.1795692 -0.0042215 0.0459687 -0.121904 0.0062211 -0.0000162 0.0038933 0.1022442 0.034088 -0.0266314 0.0895237 -0.0065696 0.0564602 -0.0312404 0.0971101 0.00805 -0.022675 0.0273747 -0.0325859 -0.0895446 -0.0117109 0.0575093 0.0266616 -0.0984067 -0.011794 -0.0175082 0.1191065 -0.0281444 0.0056461 -0.1267028 0.3486434 0.003629 0.0089206 0.0017849 0.3912219 unknown
polarizability: 165.2921042|2.4356141|127.8253457|-1.969124|-2.0900734|60.3861328 unknown
InChI: InChI=1S/C10H12O2/c1-6-4-8(3)9(10(11)12)5-7(6)2/h4-5,11H,1-3H3
charge 0 multiplicity 1
24 atoms
O  -2.467065 1.931259 0.015586
O  -3.270507 -0.235591 0.098625
C  1.938734 -0.476248 0.012117
C  1.526788 0.892145 -0.021079
C  -0.43953 -1.221739 0.077787
C  -0.840007 0.152498 0.043466
C  0.95165 -1.488803 0.060482
C  0.147675 1.175515 -0.00459
C  3.409518 -0.844711 -0.00407
C  2.544855 2.016498 -0.072834
C  -1.413223 -2.383547 0.130882
C  -2.274104 0.532022 0.056845
H  1.27811 -2.535931 0.086077
H  -0.191772 2.214869 -0.029314
H  3.551198 -1.937669 0.032301
H  3.911123 -0.46622 -0.915675
H  3.946704 -0.402424 0.85705
H  3.2222 1.994466 0.8027
H  3.18678 1.945003 -0.972133
H  2.04912 3.001476 -0.090582
H  -0.866267 -3.341878 0.151404
H  -2.067234 -2.325631 1.018642
H  -2.097504 -2.380522 -0.735717
H  -3.446844 2.101963 0.027231
