program: Gaussian 09
title: 000096479
version: EM64L-G09RevD.01
frameworkgroup: C1[X(C11H15ClO)]
method: RPBEPBE
basis: SDD
operation: Freq
keyword: #p
keyword: freq=noraman
keyword: PBEPBE/SDD
title: #p freq=noraman PBEPBE/SDD
converged: YES YES NO NO
title: Mulliken charges:
elementType: Cl O C C C C C C C C C C C H H H H H H H H H H H H H H H
charge: -0.080827 -0.267084 -0.372373 -0.331791 -0.290091 -0.590058 0.350581 0.440155 -0.379623 -0.341963 -0.331169 -0.422396 -0.809322 0.208593 0.237745 0.226554 0.201696 0.204314 0.196504 0.258438 0.267516 0.248220 0.243016 0.229179 0.225675 0.227537 0.222064 0.228909
chargesum: 0.00000
title: Mulliken charges with hydrogens summed into heavy atoms:
elementType: Cl O C C C C C C C C C C C
charge: -0.080827 -0.267084 0.073964 0.096458 0.110727 -0.064103 0.350581 0.440155 -0.131403 -0.098946 -0.101989 -0.196720 -0.130812
polarizability: 1.88406043e+02 -2.66323964e-01 1.21925739e+02 3.60001092e+00 -2.47575582e+00 8.39435748e+01
1716.lowfreq: -3.0944 -2.1308 -0.0015 -0.0014 0.0015 9.3975 23.0974 31.4698 39.8971
frequency: 22.8722 30.6816 39.4661 60.7217 79.8484 122.5042 137.0187 160.7317 202.3628 237.0292 300.4000 328.2249 329.9718 414.7101 421.3863 474.4299 508.9681 537.0341 597.2545 634.9259 711.7041 730.2718 767.5835 809.3313 814.4352 829.4440 846.9907 888.8525 930.6500 963.2003 971.6445 984.9958 1005.7952 1011.6258 1046.9740 1052.3098 1086.9220 1103.0783 1120.9659 1157.1111 1180.4173 1190.9977 1217.3481 1225.5147 1258.0242 1282.4289 1285.3893 1305.1303 1305.8633 1362.3380 1371.1322 1389.1961 1398.5570 1415.3531 1449.9292 1453.3912 1470.2055 1472.9987 1477.0015 1486.6412 1505.0320 1586.2604 1627.0017 2937.1578 2957.7780 2972.9318 2992.8328 3003.5254 3027.4066 3049.4183 3052.2318 3076.0952 3080.3248 3120.8450 3123.1919 3132.9595 3159.1481 3163.0695
redmass: 5.0115 1.9055 1.6425 4.2401 4.2380 3.1525 2.0937 4.1666 2.4926 3.6390 3.4829 2.8813 4.2892 2.9419 3.1942 4.5569 2.4634 4.2326 4.3335 6.8016 2.9842 4.9922 1.1772 1.4249 5.2729 1.3639 1.4256 1.4371 1.3253 1.3466 4.0082 1.5441 2.6138 2.6380 1.5259 1.4584 2.7116 2.0628 1.2636 1.2920 1.2669 1.3130 2.1130 5.5399 1.2400 1.1069 1.2755 1.1882 1.2356 1.6267 3.0150 1.6181 1.2564 3.5497 1.0801 1.0999 1.0458 1.0957 1.0980 1.1700 2.2377 6.4549 6.4109 1.0551 1.0640 1.0372 1.1022 1.0664 1.0906 1.0977 1.0595 1.1031 1.0984 1.0893 1.0890 1.1112 1.0938 1.0953
irintensity: 0.5832 1.0896 0.3555 1.7246 1.1933 0.4759 2.8420 0.6908 1.5130 1.8358 4.8404 0.9032 5.1167 0.0032 0.7331 2.5736 20.6590 3.6637 21.4396 0.0945 0.6883 15.7246 23.5645 33.5606 5.7167 33.5460 13.2535 5.6971 1.3330 0.4753 42.4017 0.6854 16.6549 33.6507 11.2061 4.1292 5.1183 2.0879 16.8443 2.2892 71.2833 8.1651 134.0508 100.6346 3.5712 2.3592 8.1101 15.3954 5.9855 3.0834 2.1090 23.4668 12.8222 3.6491 7.4048 5.9385 12.1901 13.1805 12.4786 62.0502 109.1819 14.1946 33.5808 36.5660 29.4180 49.3511 28.9523 21.4670 12.3625 24.4731 31.1511 41.2059 20.3508 17.7050 25.4669 19.1210 20.7128 3.0009
temp: 298.150 k
press: 1.00000 atm
elementType: 17 8 6 6 6 6 6 6 6 6 6 6 6 1 1 1 1 1 1 1 1 1 1 1 1 1 1 1
symmnumber: 1
zpe: 610331.7 jmol-1
zpe.correction: 0.232463 hartree
zpe.thermalcorrener: 0.246536 hartree
zpe.thermalcorrenthalpy: 0.247481 hartree
zpe.thermalcorrgfe: 0.188445 hartree
zpe.sumelectzpe: -962.455805 hartree
zpe.sumelectthermal: -962.441732 hartree
zpe.sumelectthermalent: -962.440788 hartree
zpe.sumelectthermalfe: -962.499824 hartree
dipole: -0.6275 2.8527 1.2055
dipole: 3.1599
quadrupole: -84.6858 -80.7657 -87.6134
quadrupole: 9.0784 8.4559 -1.1247
quadrupole: -0.3308 3.5893 -3.2585 9.0784 8.4559 -1.1247
hfenergy: -962.6882685 hartree
pointgroup: C01 [X(C11H15Cl1O1)]
dipole: 0.2204676 1.1245067 -0.4821039 debye
polarizability: 188.4755019|1.3704682|121.9672162|1.6654538|2.3807123|83.8326385 unknown
InChI: InChI=1S/C11H15ClO/c1-10-4-6-11(7-5-10)13-9-3-2-8-12/h4-7H,2-3,8-9H2,1H3
charge 0 multiplicity 1
28 atoms
Cl -5.811656 -0.818894 0.994186
O  -0.430082 -0.601853 -0.196714
C  -2.787911 -0.098897 -0.230417
C  -3.88887 0.971813 -0.071043
C  -1.394358 0.490376 0.001629
C  -5.303705 0.451802 -0.322259
C  0.935071 -0.305374 -0.028127
C  3.750801 0.069802 0.263429
C  1.823149 -1.392249 -0.226001
C  1.447172 0.968807 0.314232
C  3.208628 -1.200004 -0.080856
C  2.84581 1.139388 0.455272
C  5.250462 0.258914 0.420035
H  -2.82752 -0.536776 -1.246316
H  -2.958898 -0.922007 0.486381
H  -3.841543 1.427356 0.937118
H  -3.71698 1.794413 -0.799606
H  -1.301359 0.892439 1.033079
H  -1.182699 1.311695 -0.71671
H  -5.395142 -0.081987 -1.28114
H  -6.062414 1.245204 -0.247877
H  1.405674 -2.36909 -0.489539
H  0.78352 1.824181 0.472715
H  3.884962 -2.049741 -0.236558
H  3.233743 2.130419 0.721002
H  5.79231 -0.014755 -0.505098
H  5.502406 1.307014 0.657749
H  5.65513 -0.374797 1.232136
