program: Gaussian 09
title: 000096511
version: EM64L-G09RevD.01
frameworkgroup: C1[X(C16H19NO3)]
method: RPBEPBE
basis: SDD
operation: Freq
keyword: #p
keyword: freq=noraman
keyword: PBEPBE/SDD
title: #p freq=noraman PBEPBE/SDD
converged: YES YES NO NO
title: Mulliken charges:
elementType: O O O N C C C C C C C C C C C C C C C C H H H H H H H H H H H H H H H H H H H
charge: -0.318736 -0.277739 -0.301017 -0.202605 -0.007829 -0.536733 -0.089410 0.058765 0.209808 0.009649 0.100181 -0.707421 -0.708319 0.223246 -0.612395 0.255344 -0.411051 -0.358937 -0.264578 -0.536519 0.231471 0.251093 0.240531 0.220717 0.202523 0.213729 0.241574 0.208211 0.221854 0.238205 0.246287 0.249746 0.258875 0.287395 0.239932 0.228961 0.225772 0.227337 0.242083
chargesum: 0.00000
title: Mulliken charges with hydrogens summed into heavy atoms:
elementType: O O O N C C C C C C C C C C C C C C C C
charge: -0.318736 -0.277739 -0.301017 -0.202605 0.223642 -0.045109 0.131307 0.058765 0.209808 0.009649 0.100181 -0.049595 -0.040048 0.223246 0.142512 0.255344 -0.123656 -0.119005 -0.035617 0.158673
polarizability: 2.73201165e+02 1.88401259e+00 2.15988302e+02 -5.37710573e+00 1.98343088e+00 1.04490123e+02
1716.lowfreq: -4.9403 -2.1393 -0.0007 0.0004 0.0005 6.7034 21.9522 32.3678 63.7637
frequency: 21.8907 32.2989 63.7565 71.6138 92.3870 96.3639 149.6351 170.3505 191.9811 195.6441 205.6259 207.9231 224.0243 249.2288 267.9679 274.0167 288.6017 313.6084 330.7826 339.7544 356.0371 362.3620 387.9572 448.4358 461.9997 491.0774 515.1205 521.7802 550.5849 588.2154 630.9520 646.9311 672.8075 684.2837 702.9351 754.9162 774.8716 807.8149 809.4646 824.9763 879.8669 900.0193 915.5829 922.3012 940.5766 953.9457 965.1964 989.9500 1005.5180 1035.8142 1040.8723 1079.6376 1111.3291 1113.8304 1115.8158 1122.3243 1134.5702 1149.0245 1152.3306 1169.9037 1183.7788 1203.9365 1212.0715 1239.7991 1252.1627 1271.0780 1280.3117 1296.0740 1305.2414 1353.9636 1361.8869 1379.6403 1382.0948 1398.3995 1416.8960 1429.1970 1439.8304 1456.4788 1465.7586 1467.6706 1468.1076 1470.0145 1473.9069 1477.0170 1477.9056 1482.5534 1489.9997 1491.2187 1561.7290 1572.9639 1610.6278 1640.4889 2961.0984 2974.9314 2977.3171 2979.5083 2985.8487 3004.3912 3028.8132 3050.7518 3057.0931 3065.3658 3073.3791 3082.9523 3094.8773 3120.9433 3127.6625 3141.1019 3142.4552 3161.1533 3173.7138
redmass: 3.3295 3.7796 2.5947 4.9305 3.9078 3.7459 4.1153 4.4343 1.8821 1.7164 1.0796 1.9839 1.2917 2.5018 3.0396 1.8150 2.5450 7.1544 3.8338 3.1367 3.1138 3.2218 3.1995 3.7040 4.5211 5.1890 6.6287 5.1274 4.3050 5.0406 6.3430 7.4485 4.2850 5.1578 5.6929 1.9388 3.2938 5.9927 2.7345 3.8193 3.1037 1.3979 4.5691 1.2448 2.5807 1.4311 1.5902 1.3138 6.5932 3.0702 3.7494 2.2872 1.2596 1.5411 2.1794 1.2944 1.9499 2.0470 1.3360 1.6559 1.2642 1.9708 3.3202 1.7862 2.0103 2.2645 1.5443 1.3831 1.4789 3.6427 2.0207 1.2738 6.3114 1.2149 2.5485 1.7652 1.4748 1.7533 1.4291 1.0522 1.0525 1.1754 1.0644 1.1178 1.0478 1.0532 1.4367 1.0801 6.4818 8.7256 7.4174 9.3941 1.0325 1.0373 1.0486 1.0701 1.0657 1.0874 1.0327 1.1042 1.0977 1.0987 1.0982 1.0997 1.0990 1.0998 1.1029 1.0866 1.1027 1.0922 1.0973
irintensity: 0.0578 0.2656 1.2773 0.0465 4.9594 8.5293 0.0782 3.9849 2.3004 1.8801 0.1714 0.3681 0.5019 3.7492 0.6129 0.7554 0.1678 7.8155 1.0540 0.1785 0.6909 0.0822 1.8573 5.0657 5.4489 5.8538 11.4379 1.3233 0.1543 5.7693 4.1412 2.2373 5.2322 5.8281 0.6288 68.5139 40.3694 25.6257 16.7564 9.2713 9.7836 0.6681 86.1806 7.5582 31.0819 26.2456 8.7879 2.7506 15.1774 39.2388 49.4600 35.6593 0.2170 3.8605 36.1588 0.9554 2.6031 144.4269 3.5221 4.7523 1.9449 42.3896 93.4813 76.8053 19.3484 39.5360 6.0521 14.4137 4.1944 48.7377 6.2624 20.4613 10.3580 31.2769 8.8745 71.5365 78.2731 22.5669 19.6002 13.4490 6.3237 28.2404 1.3888 45.5907 13.3858 9.0406 117.6932 52.3748 267.7169 71.7539 7.2504 229.3094 75.9261 24.0225 18.7031 15.7546 38.5708 43.8685 34.6438 41.5649 14.2501 10.0448 75.1820 35.1558 34.0540 20.9316 15.9483 8.6452 2.3339 3.1006 24.5029
temp: 298.150 k
press: 1.00000 atm
elementType: 8 8 8 7 6 6 6 6 6 6 6 6 6 6 6 6 6 6 6 6 1 1 1 1 1 1 1 1 1 1 1 1 1 1 1 1 1 1 1
symmnumber: 1
zpe: 835564.9 jmol-1
zpe.correction: 0.318250 hartree
zpe.thermalcorrener: 0.337485 hartree
zpe.thermalcorrenthalpy: 0.338429 hartree
zpe.thermalcorrgfe: 0.270422 hartree
zpe.sumelectzpe: -900.039737 hartree
zpe.sumelectthermal: -900.020502 hartree
zpe.sumelectthermalent: -900.019557 hartree
zpe.sumelectthermalfe: -900.087565 hartree
dipole: -0.9403 -6.0679 -0.0599
dipole: 6.1406
quadrupole: -84.5488 -129.3079 -119.5416
quadrupole: 7.9156 -1.4662 -0.1251
quadrupole: 26.5840 -18.1751 -8.4088 7.9156 -1.4662 -0.1251
hfenergy: -900.3579864 hartree
pointgroup: C01 [X(C16H19N1O3)]
dipole: -0.253925 2.40183 0.0581785 debye
polarizability: 272.8301782|-4.4111291|216.2619504|-6.3990014|2.8211347|104.5874613 unknown
InChI: InChI=1S/C16H19NO3/c1-9(2)13-8-11-15(18)10-6-5-7-12(19-4)14(10)17(3)16(11)20-13/h5-7,9,13H,8H2,1-4H3
charge 0 multiplicity 1
39 atoms
O  2.05527 1.029557 0.176029
O  0.006789 -3.245455 0.031289
O  -2.947779 2.156453 0.20388
N  -0.330148 0.976292 0.220188
C  3.194299 0.000596 0.257888
C  2.520668 -1.384402 0.010045
C  4.289509 0.411391 -0.73926
C  1.04275 -1.072308 0.107595
C  0.869806 0.299439 0.170189
C  -0.080625 -1.96527 0.090019
C  -1.517516 0.180528 0.18776
C  4.755568 1.866893 -0.507715
C  5.480111 -0.574087 -0.627698
C  -1.405462 -1.253053 0.139596
C  -0.292196 2.457419 0.364028
C  -2.841048 0.749231 0.19459
C  -2.568684 -2.065436 0.123276
C  -3.97685 -0.084649 0.183831
C  -3.844174 -1.494082 0.151259
C  -4.288997 2.742257 0.179025
H  3.567473 0.092485 1.296868
H  2.836539 -2.135082 0.754556
H  2.778988 -1.787445 -0.988657
H  3.855326 0.331928 -1.757104
H  5.205892 1.979728 0.497647
H  5.520084 2.151739 -1.253406
H  3.911351 2.572533 -0.586526
H  5.929406 -0.534717 0.383336
H  6.266766 -0.303558 -1.354522
H  5.178322 -1.617583 -0.82838
H  -0.83397 2.767652 1.269445
H  -0.75507 2.944903 -0.505932
H  0.762927 2.755535 0.439863
H  -2.406832 -3.147258 0.086337
H  -4.976827 0.357481 0.196159
H  -4.740547 -2.122566 0.142853
H  -4.87005 2.461777 1.078902
H  -4.843323 2.442421 -0.731331
H  -4.122145 3.829812 0.170581
