program: Gaussian 09
title: 000096460
version: EM64L-G09RevD.01
frameworkgroup: C1[X(C6H7N3O3)]
method: RPBEPBE
basis: SDD
operation: Freq
keyword: #pfreq=noraman
keyword: PBEPBE/SDD
title: #p freq=noraman PBEPBE/SDD
converged: YES YES NO YES
title: Mulliken charges:
elementType: O O O N N N C C C C C C H H H H H H H
charge: -0.222222 -0.214528 -0.198754 -0.109065 -0.003759 0.032608 0.228690 0.382171 0.130940 -0.380620 -0.745638 -0.730833 0.303227 0.265506 0.230009 0.265505 0.255983 0.254803 0.255979
chargesum: 0.00000
title: Mulliken charges with hydrogens summed into heavy atoms:
elementType: O O O N N N C C C C C C
charge: -0.222222 -0.214528 -0.198754 -0.109065 -0.003759 0.032608 0.228690 0.382171 0.130940 -0.077393 0.015382 0.035932
polarizability: 1.68177107e+02 -3.27722967e+00 1.15446676e+02 -1.07526256e-02 3.74796431e-03 4.79158412e+01
1716.lowfreq: 0.0006 0.0009 0.0009 6.9809 8.7839 9.1807 41.0682 71.1574 148.2286
frequency: 41.0653 71.1573 148.2279 168.1047 210.6719 213.5115 246.4767 304.6672 335.1836 338.7368 352.2672 433.3470 444.3156 475.8821 598.9607 611.7301 626.2572 686.9727 718.2867 730.6795 733.7174 817.6401 930.4935 977.9187 1017.5884 1026.3361 1039.6853 1049.4670 1056.5404 1193.1297 1203.4150 1221.8964 1323.0242 1339.8848 1340.5343 1380.8140 1406.0388 1412.5907 1442.9357 1451.1008 1452.3089 1464.8327 1513.0307 1620.4248 2995.1277 3008.3456 3072.2350 3091.9512 3119.6445 3131.7281 3189.3929
redmass: 9.3473 5.2016 2.4971 1.2268 1.1783 6.1529 3.5126 3.1120 4.1950 4.6638 7.7662 9.8101 3.9221 5.2014 4.9869 5.4728 7.0442 8.1540 6.2021 10.0819 6.6406 4.5633 1.3405 2.5044 4.0186 1.4945 1.5462 1.4984 3.4497 5.7954 2.4901 5.2578 6.0781 6.0447 4.0290 3.8070 1.3399 1.2550 1.0431 1.0456 1.1760 1.1917 7.1015 6.6800 1.0373 1.0363 1.0965 1.0962 1.1004 1.1019 1.0928
irintensity: 0.0016 10.2005 0.2202 1.3856 1.6815 4.9932 1.0427 4.8994 2.8988 0.6507 1.5216 5.9130 0.0201 0.8489 2.7410 1.2597 17.4738 0.0063 0.9504 5.7046 10.0741 6.0292 13.3319 13.2583 8.0015 17.2096 4.0577 10.4400 2.8388 263.2406 69.3240 87.2427 63.8739 77.8184 58.8262 210.5897 4.2097 17.6565 16.0911 17.7270 13.2106 6.3278 63.0959 39.9945 4.9897 0.6009 5.1645 3.9778 8.6949 9.2371 6.2999
temp: 298.150 k
press: 1.00000 atm
elementType: 8 8 8 7 7 7 6 6 6 6 6 6 1 1 1 1 1 1 1
symmnumber: 1
zpe: 351584.1 jmol-1
zpe.correction: 0.133911 hartree
zpe.thermalcorrener: 0.144876 hartree
zpe.thermalcorrenthalpy: 0.145820 hartree
zpe.thermalcorrgfe: 0.096760 hartree
zpe.sumelectzpe: -621.723978 hartree
zpe.sumelectthermal: -621.713014 hartree
zpe.sumelectthermalent: -621.712070 hartree
zpe.sumelectthermalfe: -621.761130 hartree
dipole: -1.6589 -1.4817 -0.0005
dipole: 2.2243
quadrupole: -85.3998 -69.9388 -67.2296
quadrupole: 16.8870 0.0031 -0.0009
quadrupole: -11.2104 4.2506 6.9598 16.8870 0.0031 -0.0009
hfenergy: -621.8578893 hartree
pointgroup: C01 [X(C6H7N3O3)]
dipole: 0.6162888 -0.6212733 0.0001884 debye
dipolederiv: -1.0794871 -0.1837535 0.0001037 -0.1915834 -0.3433676 0.0000345 0.0001534 0.0000369 -0.2527153 -0.5781611 -0.1623189 0.0000217 -0.359442 -0.857141 -0.0000057 0.0000239 -0.0000164 -0.238792 -0.8876175 0.139832 0.0000688 0.2633001 -0.5369581 -0.0000476 0.000042 -0.0000377 -0.211868 1.1054676 0.1649548 -0.0002084 0.4694588 0.26856 -0.0000365 -0.0002668 -0.0000647 0.1669741 -0.6896485 0.1010488 0.000078 0.2330207 -0.1041725 -0.0000218 0.0000597 -0.0000198 -0.2191498 1.9087836 0.2608177 -0.0001506 0.3236815 1.2094119 0.0000618 -0.0001061 0.0000559 0.1872121 -0.9500873 -0.2501856 0.0000979 -0.0238768 -0.3398395 0.0000045 0.0000484 -0.0000019 0.04259 -0.0481573 -0.3752559 0.0000689 -0.7319377 0.0324431 0.000037 -0.0000069 0.0001499 0.0150245 0.5408254 -0.1947407 -0.0000434 0.0118516 0.5292987 -0.0000336 -0.0000396 0.0000065 0.1104608 0.4237357 0.2079381 -0.0000482 -0.1445611 -0.0252705 0.0000209 -0.0000323 -0.0000266 -0.0462451 -0.1571363 0.2175751 -0.0000295 0.0888196 0.0193408 -0.0000482 0.0001493 -0.0002829 0.0352134 -0.1153153 0.3060171 -0.0000066 0.1503442 -0.107011 -0.0000061 0.0000025 -0.0000036 0.0054636 0.1553169 -0.0257912 -0.0000036 0.0221891 0.0660907 0.0000168 -0.0000057 0.0000212 0.1543802 0.0598534 0.0173985 -0.0712177 -0.020244 0.0630614 -0.0495469 -0.0746528 -0.0015025 0.0002267 0.0662713 -0.1109021 0.0001309 0.0009014 -0.0719809 0.0001858 0.0000192 0.000225 0.1216525 0.0598951 0.0175402 0.0711386 -0.0199082 0.0631189 0.0493797 0.0746183 0.0014571 -0.0001126 0.0626098 0.0034846 0.0774235 -0.0182795 0.0759741 0.0346307 0.0633235 0.0132145 0.0043009 0.0602709 -0.1371328 0.0000092 -0.0354435 -0.017527 0.0000071 0.0000055 0.0000136 0.1210671 0.0625809 0.0034739 -0.0774332 -0.0182909 0.0759684 -0.0346323 -0.0633356 -0.0132244 0.0043169 unknown
polarizability: 168.3798954|0.0772505|115.2438873|-0.0109592|-0.0030923|47.9158412 unknown
InChI: InChI=1S/C6H7N3O3/c1-4-3-6(9(11)12)5(2)7-8(4)10/h3H,1-2H3
charge 0 multiplicity 1
19 atoms
O  3.115383 0.803486 -0.000496
O  -2.467472 -1.920503 0.00006
O  -3.158196 0.254668 0.000238
N  1.860288 0.456646 -0.000214
N  0.912519 1.4853 -0.000192
N  -2.229571 -0.645952 0.000117
C  -0.823015 -0.219901 0.000047
C  1.51555 -0.913554 0.00003
C  -0.413654 1.149802 -0.000065
C  0.160497 -1.235672 0.000116
C  2.654847 -1.887316 0.000091
C  -1.323983 2.353279 -0.000053
H  -0.155673 -2.280961 0.000245
H  3.30166 -1.732154 0.882512
H  2.276436 -2.921369 0.001185
H  3.300496 -1.73369 -0.883466
H  -1.988155 2.350547 0.880883
H  -0.701184 3.260567 -0.000137
H  -1.988273 2.350478 -0.8809
