program: Gaussian 09
title: 000096467
version: EM64L-G09RevD.01
frameworkgroup: C1[X(C13H13NO2)]
method: RPBEPBE
basis: SDD
operation: Freq
keyword: #p
keyword: freq=noraman
keyword: PBEPBE/SDD
title: #p freq=noraman PBEPBE/SDD
converged: YES YES NO NO
title: Mulliken charges:
elementType: O O N C C C C C C C C C C C C C H H H H H H H H H H H H H
charge: -0.413562 -0.231627 -0.490328 0.388203 -0.559108 0.273889 -0.433838 -0.385564 -0.468057 0.345355 -0.389811 -0.393065 0.189562 -0.235034 -0.241191 -0.249539 0.231829 0.253536 0.307692 0.249816 0.240382 0.271879 0.252523 0.231290 0.201295 0.224301 0.223216 0.228927 0.377030
chargesum: 0.00000
title: Mulliken charges with hydrogens summed into heavy atoms:
elementType: O O N C C C C C C C C C C C C C
charge: -0.036532 -0.231627 -0.182636 0.388203 -0.073742 0.273889 -0.184022 -0.145182 0.056344 0.345355 -0.158521 -0.191771 0.189562 -0.010733 -0.017975 -0.020612
polarizability: 2.49585486e+02 -2.05105435e+01 1.52130453e+02 -6.77418025e+00 -6.12845262e+00 8.57286484e+01
1716.lowfreq: -10.0999 -0.0008 -0.0004 -0.0004 1.4457 6.2039 11.7621 23.5472 31.1814
frequency: 10.9248 23.4459 31.1675 69.6724 70.5888 101.8245 126.9039 178.9490 232.5202 303.1185 311.8827 356.8027 402.5643 431.0262 454.4733 501.1537 504.8984 564.6164 576.5211 615.7534 638.8741 639.3894 661.1545 670.0355 695.1910 724.1107 764.2973 768.1509 785.4492 838.0891 854.0297 877.9763 905.1757 920.1130 968.5654 982.6438 985.7257 989.5093 993.0518 1019.6269 1024.3829 1052.4885 1064.8879 1074.3671 1083.3331 1144.9209 1172.5923 1193.6274 1221.0493 1238.9182 1251.3683 1278.6578 1301.9193 1312.7194 1326.7571 1366.0780 1368.2293 1392.8172 1418.1830 1438.5044 1443.3914 1466.5230 1469.0975 1524.2922 1575.3799 1590.3059 1618.4741 1666.3787 2996.3074 3005.0500 3049.7146 3076.8774 3109.9046 3126.0261 3137.8974 3149.3991 3165.3440 3204.2495 3225.0285 3510.1592 3592.4019
redmass: 9.1851 4.7676 4.7047 2.7509 2.8967 4.6634 3.8756 7.6356 4.3718 3.4784 5.0101 5.7623 2.8131 4.1895 3.8554 1.8395 3.0163 5.0191 1.2088 6.2175 3.3710 1.3202 3.3959 5.0742 1.8747 4.7082 1.4943 1.4323 1.5580 1.2745 1.4635 3.7393 1.4856 5.7682 1.4170 4.0775 4.4152 1.3327 2.0846 3.5260 2.4330 1.2902 2.2101 2.4314 1.6320 1.2350 1.0536 1.1291 1.7069 1.4411 1.3429 1.3526 1.6965 1.4278 3.8168 1.8356 2.8424 5.0196 3.6619 1.1001 2.4870 1.6446 1.4745 5.9301 5.1268 4.9426 5.9158 8.2658 1.0648 1.0623 1.0964 1.0989 1.0870 1.0856 1.0915 1.0954 1.1014 1.0926 1.1036 1.0640 1.0800
irintensity: 1.1935 0.0360 0.2164 0.7945 0.7126 0.9532 0.1821 3.5387 0.0641 0.0094 1.5919 5.3704 0.0288 8.6839 19.2192 22.9999 12.2843 29.6891 41.7532 0.4483 13.2832 127.5362 1.4757 9.8902 40.7492 0.2487 132.9860 22.9738 28.0398 0.2650 0.4021 0.4843 5.5179 3.6474 0.0250 10.1489 4.2944 0.7176 4.4906 179.2620 5.3464 26.5771 7.8823 132.2737 11.5748 3.8583 0.2335 0.9869 41.4918 0.2535 21.7455 23.6527 20.8573 0.9051 6.5912 88.2652 1.2443 3.9340 1.5907 31.1176 10.7330 12.9300 11.8407 78.6003 2.8116 6.8026 70.0753 229.2270 17.2061 13.1277 0.9365 15.0250 18.7676 1.7101 18.5175 37.7199 23.6300 9.8033 2.7911 16.9635 28.3222
temp: 298.150 k
press: 1.00000 atm
elementType: 8 8 7 6 6 6 6 6 6 6 6 6 6 6 6 6 1 1 1 1 1 1 1 1 1 1 1 1 1
symmnumber: 1
zpe: 603982.4 jmol-1
zpe.correction: 0.230045 hartree
zpe.thermalcorrener: 0.244543 hartree
zpe.thermalcorrenthalpy: 0.245487 hartree
zpe.thermalcorrgfe: 0.184536 hartree
zpe.sumelectzpe: -707.254198 hartree
zpe.sumelectthermal: -707.239700 hartree
zpe.sumelectthermalent: -707.238756 hartree
zpe.sumelectthermalfe: -707.299707 hartree
dipole: -0.1270 -1.4919 -0.6585
dipole: 1.6357
quadrupole: -86.5869 -84.8851 -102.5132
quadrupole: 3.1733 6.6113 -3.6244
quadrupole: 4.7415 6.4433 -11.1848 3.1733 6.6113 -3.6244
hfenergy: -707.4842428 hartree
pointgroup: C01 [X(C13H13N1O2)]
dipole: 0.0414221 -0.5798916 0.275964 debye
polarizability: 250.1494958|19.014949|151.9127938|-6.7227792|4.3771211|85.382298 unknown
InChI: InChI=1S/C13H13NO2/c15-13(16)9-7-11-6-8-12(14-11)10-4-2-1-3-5-10/h1-6,8,14-15H,7,9H2
charge 0 multiplicity 1
29 atoms
O  5.339552 -1.427763 1.153007
O  5.319321 -0.546731 -0.995794
N  0.148802 0.068883 -0.399756
C  1.243564 0.935153 -0.313193
C  2.639334 0.502437 -0.673337
C  -1.03106 0.713922 0.008481
C  0.754079 2.159033 0.174803
C  -0.659429 2.024051 0.372987
C  3.331985 -0.291147 0.464856
C  -2.338851 0.049048 0.014176
C  -3.535577 0.820085 0.08169
C  -2.462948 -1.369983 -0.046397
C  4.732053 -0.737155 0.091617
C  -4.799832 0.199005 0.090043
C  -3.730347 -1.989956 -0.050032
C  -4.908302 -1.210884 0.019219
H  2.644753 -0.111224 -1.59511
H  3.244913 1.395203 -0.904988
H  0.184372 -0.868856 -0.796313
H  1.357865 3.045663 0.364387
H  -1.331673 2.785668 0.764968
H  3.392209 0.319887 1.384896
H  2.748144 -1.188928 0.745325
H  -3.467793 1.913052 0.108706
H  -1.566929 -2.003833 -0.057885
H  -5.704799 0.815049 0.141073
H  -3.798482 -3.082887 -0.095137
H  -5.892057 -1.692439 0.019568
H  6.256532 -1.705551 0.880838
