program: Gaussian 09
title: 000096440
version: EM64L-G09RevD.01
frameworkgroup: C1[X(C17H29NO)]
method: RPBEPBE
basis: SDD
operation: Freq
keyword: #p
keyword: freq=noraman
keyword: PBEPBE/SDD
title: #p freq=noraman PBEPBE/SDD
converged: YES YES NO NO
title: Mulliken charges:
elementType: O N C C C C C C C C C C C C C C C C C H H H H H H H H H H H H H H H H H H H H H H H H H H H H H
charge: -0.264528 -0.053770 -0.385508 -0.384710 -0.384141 -0.382092 -0.381817 -0.372676 -0.378033 -0.353624 -0.398692 -0.356534 -0.287543 -0.696702 0.172721 -0.334209 -0.150858 -0.322357 -0.208463 0.193818 0.193903 0.193112 0.193178 0.193658 0.193784 0.191975 0.191953 0.195309 0.195314 0.189308 0.189319 0.194010 0.193738 0.187654 0.187657 0.210958 0.210720 0.194725 0.194679 0.221040 0.220507 0.209638 0.214874 0.209584 0.254272 0.238128 0.237051 0.229671
chargesum: 0.00000
title: Mulliken charges with hydrogens summed into heavy atoms:
elementType: O N C C C C C C C C C C C C C C C C C
charge: -0.264528 -0.053770 0.002214 0.001580 0.003301 0.001835 0.008806 0.005951 0.009715 0.021687 0.022986 0.032869 0.154004 -0.062606 0.172721 -0.079938 0.087270 -0.085305 0.021208
polarizability: 2.85020832e+02 4.82395263e+00 1.76382087e+02 -2.34517090e-01 -8.74080146e-02 1.29986599e+02
1716.lowfreq: -4.8861 -0.0016 0.0006 0.0013 2.6159 11.1037 15.7650 17.2483 33.6459
frequency: 14.8103 15.9664 33.5477 45.1435 50.6651 60.7415 72.7899 94.4250 100.7583 102.1262 125.7204 128.0149 130.5328 146.3332 157.3290 161.6651 171.4038 218.3571 224.3260 238.6324 272.5367 323.1261 390.6971 407.2080 414.5814 471.1393 484.9389 511.0290 515.3737 605.8371 622.6093 722.1559 723.6701 728.8159 736.8733 741.2395 762.4480 777.7650 794.8437 814.2101 836.7164 874.4506 886.9174 887.7895 941.0337 946.7986 949.1117 954.1571 981.0847 987.3777 991.0517 992.6416 1018.3430 1030.6796 1031.6112 1037.5796 1055.0942 1071.7940 1077.6581 1080.4596 1082.3112 1087.6718 1100.5138 1125.1658 1149.9953 1155.5033 1182.4839 1202.6991 1204.4357 1227.6142 1233.9497 1252.1079 1252.7809 1262.2577 1270.6945 1279.8493 1282.3439 1286.8637 1290.2416 1290.3109 1293.5523 1299.4222 1301.3274 1312.5971 1331.5728 1334.3566 1349.5229 1354.5741 1356.9194 1358.7362 1369.3939 1387.3622 1414.8035 1447.7852 1460.9324 1461.1162 1464.0216 1464.5917 1467.6217 1468.9528 1472.9068 1475.5180 1477.3906 1481.9068 1486.1992 1489.6429 1491.2797 1556.8574 1587.0872 2949.5454 2949.8538 2951.3686 2952.1974 2954.1396 2956.6575 2961.3842 2965.8019 2968.7670 2971.2400 2982.6415 2985.4444 2988.6399 2990.0003 2995.8217 2996.9241 3003.9154 3014.0637 3024.8336 3034.0762 3040.9879 3044.9144 3067.5626 3070.3903 3071.1972 3131.2342 3143.9808 3171.2407 3182.4516
redmass: 4.3408 4.3939 4.0910 1.9676 4.1829 3.5371 1.5923 3.1640 1.6345 3.9690 2.0498 5.1222 2.1828 2.0717 2.1000 2.0983 3.8346 4.9894 1.1364 3.6405 4.2774 3.2894 3.9535 3.1528 3.5076 3.5628 3.1790 3.5145 2.8716 7.0781 6.8719 1.0583 1.0665 1.0810 2.4256 1.1069 1.1295 1.7091 1.1722 6.8520 1.2078 1.3268 1.9002 1.2240 1.2071 7.8379 1.4196 6.8069 5.0051 1.3167 1.1631 4.6643 3.8981 1.0689 2.2283 3.4215 3.1556 2.6559 2.4990 2.0885 2.1575 1.7611 2.2442 3.1612 1.4067 1.0792 1.8443 1.5476 1.2705 1.3983 1.3022 1.2992 2.4896 1.4240 1.1812 1.0413 1.1024 1.4044 1.0794 1.4708 1.1192 1.1023 1.1131 1.3432 10.2373 1.4010 1.4788 1.7049 1.6192 1.6251 1.5851 1.2174 2.0363 2.1606 1.0738 1.0727 1.0675 1.0749 1.0709 1.0858 1.0859 1.0426 1.0866 1.0903 1.0938 1.0952 1.1002 6.4290 5.7978 1.0585 1.0586 1.0590 1.0592 1.0591 1.0594 1.0592 1.0587 1.0586 1.0365 1.0961 1.0970 1.0597 1.0985 1.1004 1.0566 1.1025 1.1040 1.1047 1.1046 1.1045 1.1048 1.1007 1.0993 1.1073 1.0886 1.0899 1.0954 1.0999
irintensity: 0.0463 0.0508 0.3852 0.0020 0.1482 0.8377 0.0379 1.3535 0.3022 0.7666 2.2209 0.2037 0.0413 2.2524 0.0004 0.7269 1.1822 1.4690 0.0001 2.6069 1.2272 1.6699 0.9312 1.3229 3.6649 0.2930 0.5136 0.1257 5.3982 4.0366 3.6736 18.5227 0.1148 7.6539 14.2486 0.0015 3.3454 80.3350 0.4492 13.0276 0.3872 0.8896 5.3387 0.4729 0.1635 68.0246 1.4799 27.7703 0.1395 0.3226 0.4988 16.2242 3.2123 0.0282 9.1228 5.5798 4.5703 0.5842 3.6871 0.0932 0.2400 4.2933 25.4245 5.8285 0.6418 11.6529 0.0316 0.1349 20.5756 0.0174 1.0549 0.0906 250.2906 46.7326 0.2636 0.0072 0.7735 6.6655 0.0348 1.4976 0.0540 0.1011 0.0717 0.1038 56.6380 0.2963 5.5507 0.0519 0.4296 2.4704 39.6280 11.1462 31.3132 149.1131 0.0769 0.0024 0.0348 0.0785 0.2234 0.7226 0.5782 12.3073 0.5554 1.6380 0.0671 10.3513 35.1165 26.7272 152.3632 0.0320 0.0109 0.0512 0.6889 0.0607 2.7977 1.5179 84.7764 229.1401 37.8878 0.0089 0.0743 12.1307 0.2273 0.4122 55.3113 0.6357 0.2456 8.0901 0.0049 81.1139 181.4460 98.8628 55.6676 98.4976 15.3305 13.4126 24.4347 8.7918
temp: 298.150 k
press: 1.00000 atm
elementType: 8 7 6 6 6 6 6 6 6 6 6 6 6 6 6 6 6 6 6 1 1 1 1 1 1 1 1 1 1 1 1 1 1 1 1 1 1 1 1 1 1 1 1 1 1 1 1 1
symmnumber: 1
zpe: 1116748.4 jmol-1
zpe.correction: 0.425347 hartree
zpe.thermalcorrener: 0.447647 hartree
zpe.thermalcorrenthalpy: 0.448591 hartree
zpe.thermalcorrgfe: 0.369659 hartree
zpe.sumelectzpe: -793.666155 hartree
zpe.sumelectthermal: -793.643855 hartree
zpe.sumelectthermalent: -793.642911 hartree
zpe.sumelectthermalfe: -793.721844 hartree
dipole: 0.4293 -0.0871 -0.0015
dipole: 0.4381
quadrupole: -102.9951 -118.2188 -119.6605
quadrupole: -1.8636 -0.0758 -0.0640
quadrupole: 10.6297 -4.5940 -6.0357 -1.8636 -0.0758 -0.0640
hfenergy: -794.0915022 hartree
pointgroup: C01 [X(C17H29N1O1)]
dipole: 0.1688936 -0.0343163 0.0003377 debye
polarizability: 285.0244198|4.779255|176.3441734|-0.2955309|-1.2672748|130.0209242 unknown
InChI: InChI=1S/C17H29NO/c1-2-3-4-5-6-7-8-9-10-13-16-19-17-14-11-12-15-18-17/h11-12,14-15H,2-10,13,16H2,1H3
charge 0 multiplicity 1
48 atoms
O  4.392508 -0.805905 0.031064
N  5.849734 1.063274 -0.028699
C  -3.177969 -0.472462 0.010018
C  -4.438081 0.422035 0.001009
C  -1.857392 0.330247 0.006939
C  -5.758733 -0.380598 0.001259
C  -0.597626 -0.564191 0.01693
C  -7.019399 0.513458 -0.005769
C  0.720647 0.241975 0.009217
C  -8.340649 -0.288131 -0.006656
C  1.976419 -0.660165 0.024598
C  -9.600349 0.608025 -0.013286
C  3.264179 0.164101 0.007162
C  -10.916317 -0.199792 -0.013592
C  5.676745 -0.282544 0.011804
C  6.749136 -1.216873 0.036229
C  8.059306 -0.709001 0.016352
C  7.133812 1.533562 -0.047422
C  8.266344 0.695977 -0.026604
H  -3.199801 -1.144843 -0.873264
H  -3.203586 -1.132289 0.90259
H  -4.411767 1.083073 -0.890647
H  -4.41741 1.093199 0.885199
H  -1.832212 0.989434 -0.88616
H  -1.836277 1.003353 0.889674
H  -5.780115 -1.05072 -0.883763
H  -5.784553 -1.04299 0.891999
H  -0.61932 -1.239021 -0.864134
H  -0.620333 -1.220824 0.911627
H  -6.993133 1.176471 -0.896101
H  -6.998263 1.183188 0.879673
H  0.738813 0.919765 0.888227
H  0.74278 0.895585 -0.887878
H  -8.3640 -0.957422 -0.892349
H  -8.368852 -0.951468 0.883356
H  1.968421 -1.302474 0.926374
H  1.966128 -1.335984 -0.852325
H  -9.57516 1.276963 0.871368
H  -9.570688 1.270092 -0.902964
H  3.348867 0.790345 -0.900788
H  3.34692 0.831301 0.885784
H  -10.985165 -0.84452 0.883101
H  -11.80082 0.463589 -0.021865
H  -10.977294 -0.856224 -0.902354
H  6.533063 -2.28766 0.069109
H  8.912153 -1.396016 0.034033
H  7.239108 2.6241 -0.080214
H  9.27228 1.124704 -0.043062
