program: Gaussian 09
title: 000096482
version: EM64L-G09RevD.01
frameworkgroup: C1[X(C19H19N3O)]
method: RPBEPBE
basis: SDD
operation: Freq
keyword: #p
keyword: freq=noraman
keyword: PBEPBE/SDD
title: #p freq=noraman PBEPBE/SDD
converged: YES YES NO NO
title: Mulliken charges:
elementType: O N N N C C C C C C C C C C C C C C C C C C C H H H H H H H H H H H H H H H H H H H
charge: -0.248674 -0.100316 -0.342103 -0.448797 -0.390147 -0.477261 0.406598 -0.389595 -0.400979 -0.483668 0.237019 0.240760 0.144848 0.449814 -0.316424 -0.340562 -0.378492 -0.450772 -0.240883 -0.215713 -0.231303 -0.221606 -0.245305 0.185665 0.218159 0.212021 0.278410 0.255699 0.188725 0.244136 0.223418 0.187670 0.329740 0.255198 0.234606 0.270524 0.231019 0.225022 0.226737 0.226031 0.223871 0.226911
chargesum: 0.00000
title: Mulliken charges with hydrogens summed into heavy atoms:
elementType: O N N N C C C C C C C C C C C C C C C C C C C
charge: -0.248674 -0.100316 -0.342103 -0.119057 0.013677 0.013170 0.406598 0.054830 -0.156844 -0.072580 0.237019 0.240760 0.144848 0.449814 -0.061226 -0.105956 -0.107967 -0.219753 -0.015862 0.011024 -0.005272 0.002265 -0.018395
polarizability: 2.97763951e+02 4.21900483e+00 2.19739031e+02 2.27593633e+00 -1.45010476e+01 1.58950840e+02
1716.lowfreq: -7.4109 -4.5371 0.0000 0.0008 0.0009 9.3106 23.2359 25.6365 31.8569
frequency: 22.8855 25.5344 31.8459 64.3989 72.8478 74.3454 133.1462 138.6816 179.4353 190.1391 217.1279 236.1935 276.8672 294.7104 312.5677 319.0318 331.9746 370.7625 389.9971 407.0462 433.3376 460.0186 481.2312 496.1861 528.7007 551.1783 555.4807 573.7270 595.6921 616.9733 617.9498 646.8934 686.2977 703.3388 705.3769 735.3993 739.7296 747.6132 759.2067 795.0897 807.3813 824.3096 850.7864 861.1216 865.8826 899.4187 914.0679 922.2712 944.8572 961.6972 967.0588 978.9633 983.7911 989.3118 990.9430 1000.7683 1017.3754 1021.0214 1028.7367 1054.7152 1073.7679 1079.0583 1094.4052 1135.9972 1161.1711 1169.6062 1170.1763 1171.9702 1178.7615 1182.1729 1195.1800 1210.1379 1222.6303 1239.6647 1244.8290 1284.7726 1287.3680 1307.9626 1319.9308 1328.7893 1335.2096 1343.3995 1362.1206 1372.8548 1383.2197 1396.9500 1424.9984 1440.7965 1450.4554 1458.0088 1464.1434 1468.8824 1478.5644 1483.4719 1483.9833 1594.8014 1610.0674 1615.0440 1630.6485 1679.3242 1691.0739 2790.6744 2832.4686 2848.7201 2989.9780 3000.2037 3004.9084 3033.2067 3063.2832 3110.6027 3123.0471 3135.2496 3135.8046 3140.4986 3146.2439 3148.3720 3161.4559 3164.7740 3178.6485 3621.8353
redmass: 4.4643 5.3103 4.6106 3.9970 4.0033 4.0636 6.7320 3.8801 3.6866 5.2272 2.7048 4.1130 3.3632 3.9189 5.0148 2.7596 2.6429 3.5572 4.8280 2.8565 3.3188 2.8663 2.7572 7.5534 4.2492 4.0815 1.2108 3.8868 5.0000 6.2779 5.7632 4.9632 6.4063 7.0599 2.2608 1.9977 4.3231 1.3279 2.2929 2.1899 4.0553 1.3720 1.3588 1.2484 4.5515 4.3242 1.4140 1.3768 2.2323 2.6110 1.2971 2.6715 1.3942 3.6821 2.5182 1.4064 2.0639 2.0631 1.9657 2.1148 2.1998 1.5559 2.4012 2.3090 1.7900 1.0653 1.2215 2.2990 1.1331 1.9326 1.4257 2.1528 1.2569 1.5161 1.4961 1.5539 1.8479 1.4301 1.4962 1.5856 1.9941 2.2477 1.7258 2.7374 3.5079 1.9215 3.3405 2.0851 1.0923 1.1162 1.0868 2.7523 1.2277 3.1299 2.2964 6.1791 7.1808 6.1554 7.5717 9.0436 7.3189 1.0719 1.0710 1.0710 1.0860 1.0632 1.0835 1.0881 1.0979 1.0874 1.0860 1.0913 1.0855 1.0919 1.0957 1.0910 1.1014 1.0962 1.0976 1.0808
irintensity: 0.2142 0.3747 0.1256 1.1037 1.5096 0.1160 1.3198 1.4778 0.9529 1.7959 2.8159 3.2821 1.1935 2.8445 1.2802 7.4135 6.5751 0.4942 1.3332 0.2351 3.8139 16.9273 0.4951 4.5360 1.8222 14.9687 114.2873 0.3748 6.2847 0.2652 1.4733 12.4449 12.8306 0.8882 33.1052 44.2543 4.7830 119.4549 25.7951 8.6642 2.2067 13.5139 2.0225 0.1687 2.8463 4.2195 1.5404 2.7224 30.1130 13.8879 0.0248 13.5954 0.0437 0.8782 7.2557 0.8628 3.8962 25.1070 12.9010 12.4729 7.1770 7.0667 12.5211 45.1349 27.4738 0.9906 1.6252 78.5048 0.2326 8.4677 26.4194 10.6876 5.4697 10.2221 6.1179 24.0664 23.7813 28.1095 10.0975 4.5938 66.0387 96.8930 6.5692 94.2476 12.1724 4.2321 7.5112 12.6757 13.9321 7.7631 4.0311 18.5522 12.3615 115.6691 31.2314 0.9512 26.4432 6.8589 20.3445 582.1973 52.2430 64.2066 43.3045 180.3719 18.5097 25.0751 18.8035 40.2472 14.2273 9.5499 0.1454 16.9588 0.0490 20.6106 31.9889 15.2196 30.2160 23.7492 7.8148 76.2964
temp: 298.150 k
press: 1.00000 atm
elementType: 8 7 7 7 6 6 6 6 6 6 6 6 6 6 6 6 6 6 6 6 6 6 6 1 1 1 1 1 1 1 1 1 1 1 1 1 1 1 1 1 1 1
symmnumber: 1
zpe: 892771.8 jmol-1
zpe.correction: 0.340039 hartree
zpe.thermalcorrener: 0.359037 hartree
zpe.thermalcorrenthalpy: 0.359982 hartree
zpe.thermalcorrgfe: 0.290867 hartree
zpe.sumelectzpe: -973.277039 hartree
zpe.sumelectthermal: -973.258040 hartree
zpe.sumelectthermalent: -973.257096 hartree
zpe.sumelectthermalfe: -973.326211 hartree
dipole: 1.3123 -2.7466 1.1147
dipole: 3.2417
quadrupole: -113.2258 -138.1406 -130.8847
quadrupole: 2.9731 -4.4526 -0.5827
quadrupole: 14.1913 -10.7236 -3.4677 2.9731 -4.4526 -0.5827
hfenergy: -973.6170776 hartree
pointgroup: C01 [X(C19H19N3O1)]
dipole: 0.5364063 -0.9183108 0.7040001 debye
polarizability: 297.6704896|5.1729494|207.9986637|-0.5558497|-28.1762144|170.7846683 unknown
InChI: InChI=1S/C19H19N3O/c23-19-20-17-8-4-5-9-18(17)22(19)16-10-12-21(13-11-16)14-15-6-2-1-3-7-15/h1-10,20H,11-14H2
charge 0 multiplicity 1
42 atoms
O  2.211086 2.731516 -1.356278
N  -1.912075 0.632501 0.831099
N  2.226654 0.589522 -0.230966
N  4.137179 1.324403 -1.17242
C  -0.989343 1.490575 1.608081
C  0.268174 1.815237 0.778261
C  0.848729 0.545582 0.1814
C  -1.321453 -0.687253 0.523552
C  0.118923 -0.596732 0.076891
C  -3.264799 0.52638 1.417419
C  3.220478 -0.400591 -0.011448
C  4.430243 0.072042 -0.608393
C  2.786561 1.682946 -0.966063
C  -4.303046 -0.014838 0.436404
C  3.193185 -1.625383 0.679986
C  5.621821 -0.66923 -0.545862
C  -4.279072 0.376804 -0.926345
C  -5.333682 -0.877155 0.883354
C  4.394925 -2.373254 0.747726
C  5.587842 -1.908597 0.140363
C  -5.270315 -0.081661 -1.82139
C  -6.330959 -1.333815 -0.009567
C  -6.302451 -0.936639 -1.365961
H  -0.684726 1.006373 2.572217
H  -1.515883 2.428738 1.862463
H  1.025039 2.306783 1.419793
H  0.026858 2.528352 -0.029177
H  -1.922949 -1.164104 -0.274267
H  -1.384864 -1.379699 1.4089
H  0.550123 -1.49902 -0.371504
H  -3.562926 1.547814 1.729073
H  -3.276784 -0.105381 2.343934
H  4.773859 1.932832 -1.681369
H  2.280145 -1.98668 1.159771
H  6.546381 -0.303828 -1.004426
H  -3.468555 1.031265 -1.266905
H  -5.356525 -1.193763 1.934152
H  4.397738 -3.33001 1.280543
H  6.499352 -2.511968 0.204545
H  -5.240071 0.227298 -2.872695
H  -7.123102 -2.000323 0.350581
H  -7.072217 -1.291338 -2.060771
