program: Gaussian 09
title: 000096416
version: EM64L-G09RevD.01
frameworkgroup: C1[X(C8H14N4)]
method: RPBEPBE
basis: SDD
operation: Freq
keyword: #pfreq=noraman
keyword: PBEPBE/SDD
title: #p freq=noraman PBEPBE/SDD
converged: YES YES NO NO
title: Mulliken charges:
elementType: N N N N C C C C C C C C H H H H H H H H H H H H H H
charge: -0.342514 -0.342424 -0.012931 -0.012883 0.282549 0.282523 -0.667298 -0.706408 -0.667313 -0.706380 -0.220772 -0.220824 0.278439 0.278407 0.248536 0.220983 0.221495 0.224135 0.233135 0.240621 0.248542 0.220993 0.221508 0.224126 0.233125 0.240630
chargesum: 0.00000
title: Mulliken charges with hydrogens summed into heavy atoms:
elementType: N N N N C C C C C C C C
charge: -0.064075 -0.064017 -0.012931 -0.012883 0.282549 0.282523 0.023716 -0.008517 0.023731 -0.008500 -0.220772 -0.220824
polarizability: 1.20877808e+02 -5.60656575e+00 1.05214275e+02 -2.41185177e-03 -1.43991436e-04 1.00611405e+02
1716.lowfreq: -9.2653 -0.0007 -0.0001 0.0007 10.5914 12.0991 40.7746 57.9781 66.4679
frequency: 40.6987 57.9678 66.4197 127.3121 169.9536 171.2465 178.4828 200.4529 201.2558 217.5542 237.8477 256.3811 292.8980 301.0812 348.0512 379.1239 392.2921 411.6962 459.5747 557.6622 564.7385 589.5411 600.2984 677.0526 682.9704 698.5777 743.0213 872.6011 885.3261 941.4429 943.0416 951.4300 977.1591 1013.0543 1014.3579 1112.6541 1167.3177 1188.3752 1199.9982 1202.9359 1212.5897 1223.6965 1372.2386 1373.8090 1390.6468 1390.7508 1432.8003 1449.5760 1453.5059 1463.8693 1466.3952 1467.3803 1473.4368 1480.0966 1490.2858 1506.0411 2161.6633 2161.9173 2994.1038 2994.1627 3000.1717 3001.0745 3092.3517 3092.4602 3102.5291 3104.0148 3113.3391 3113.3744 3117.6224 3117.9059 3328.4578 3335.1498
redmass: 4.6795 5.1733 5.4364 4.7325 2.6119 3.2124 4.1177 1.3107 1.1623 1.6978 1.0658 1.1731 2.8187 3.7203 2.3914 3.4995 2.5288 3.7499 3.3962 5.3196 4.0172 5.8113 3.6687 4.3149 1.8008 3.6975 2.2523 2.2478 2.0524 1.6208 1.4528 1.6172 1.7490 1.3474 1.3428 4.3763 2.4818 3.0508 2.9155 2.5113 3.0749 3.3400 1.1952 1.1981 1.1961 1.1942 1.1261 1.0505 1.0630 1.0465 1.0517 1.0683 1.0580 1.0730 1.0506 1.1586 12.6730 12.6734 1.0357 1.0357 1.0348 1.0348 1.0995 1.0994 1.1013 1.1009 1.1007 1.1006 1.1003 1.1006 1.0729 1.0767
irintensity: 4.1236 0.0303 10.0529 0.6830 1.0874 2.5930 2.0002 1.8598 0.2707 1.4923 0.2941 0.7864 0.2856 6.1957 0.2381 0.0519 17.2070 0.6752 20.7615 3.6006 30.5609 10.4376 1.8114 1.9125 23.5511 1.4336 139.7895 6.0971 0.0082 0.4706 4.5919 0.6283 3.3349 0.2455 0.9308 1.0475 94.0612 3.7123 35.4593 34.6592 4.4472 28.6713 17.9786 25.6274 32.5415 11.1898 5.2690 14.4380 0.2829 0.9566 1.6418 4.2079 12.9855 34.4951 0.1549 6.1125 7.4778 2.6139 24.0117 5.1345 3.9626 23.8391 2.4148 37.6418 26.3820 1.1853 44.3562 1.9644 0.4049 24.8232 10.8746 1.7993
temp: 298.150 k
press: 1.00000 atm
elementType: 7 7 7 7 6 6 6 6 6 6 6 6 1 1 1 1 1 1 1 1 1 1 1 1 1 1
symmnumber: 1
zpe: 559680.4 jmol-1
zpe.correction: 0.213171 hartree
zpe.thermalcorrener: 0.227739 hartree
zpe.thermalcorrenthalpy: 0.228683 hartree
zpe.thermalcorrgfe: 0.172305 hartree
zpe.sumelectzpe: -531.251194 hartree
zpe.sumelectthermal: -531.236626 hartree
zpe.sumelectthermalent: -531.235682 hartree
zpe.sumelectthermalfe: -531.292060 hartree
dipole: 0.0003 -0.0020 3.3131
dipole: 3.3131
quadrupole: -81.3344 -79.0766 -76.0820
quadrupole: 18.1815 0.0065 -0.0001
quadrupole: -2.5034 -0.2456 2.7490 18.1815 0.0065 -0.0001
hfenergy: -531.4643652 hartree
pointgroup: C01 [X(C8H14N4)]
dipole: 0.0004583 -1.3034562 0.0000282 debye
dipolederiv: -0.38221 0.0732498 0.1908508 0.2158217 -0.2061692 -0.1333445 0.2043901 -0.2792684 -0.2937204 -0.3816157 -0.0731659 0.1906706 -0.2157968 -0.2058593 0.1333833 0.2044196 0.2792327 -0.2938869 -0.2207503 0.0093517 0.0139505 0.1337834 -0.2578129 -0.0661451 0.1073219 -0.0492174 -0.2621209 -0.2206234 -0.0094116 0.0138969 -0.1335646 -0.2579045 0.066054 0.1072908 0.0493704 -0.2620777 0.7024378 0.0044604 -0.1370748 0.1273033 0.4118295 0.0679642 -0.1469553 0.0787254 0.3559753 0.7020625 -0.0044296 -0.1368606 -0.1273408 0.4115109 -0.06796 -0.1465327 -0.078788 0.355972 -0.0089917 0.0136337 -0.0160509 -0.0198389 -0.067196 0.0390455 0.010559 0.0033201 -0.0393068 -0.0793345 0.022206 0.0030882 0.0153315 0.0291955 -0.0310406 -0.0183963 -0.0138019 -0.0260815 -0.0090531 -0.0136287 -0.0160028 0.0198445 -0.0671491 -0.039035 0.0105662 -0.0032235 -0.0393512 -0.07929 -0.0222609 0.0030895 -0.0154131 0.0291823 0.0310356 -0.0183823 0.0137624 -0.0261164 -0.2181467 -0.0666838 -0.0565908 -0.1428842 -0.0709468 0.0770529 -0.0580484 0.0952567 -0.0440051 -0.2182072 0.0666908 -0.0565992 0.1428409 -0.0707321 -0.0771096 -0.0582112 -0.0954095 -0.0439508 0.0822983 -0.0102016 -0.0906562 -0.0209925 0.0201257 0.1526906 -0.1508448 0.0858245 0.1467914 0.0822062 0.0101424 -0.0905905 0.0208827 0.0198964 -0.1526505 -0.1507996 -0.0857719 0.1470263 0.0809226 0.0592609 -0.1045609 0.0399348 0.0849498 0.0079519 -0.1052609 0.0306435 -0.024053 -0.13185 -0.0754984 0.0562031 -0.0263961 0.0730957 0.0171472 0.0465765 0.0156132 0.0980992 0.0949309 0.0619549 0.0652247 0.0476872 -0.0140234 -0.0749201 0.053411 -0.0959063 -0.0273513 0.1039633 -0.032347 0.0063244 0.000733 -0.1156406 0.0921938 -0.0239337 0.0524963 0.0535839 -0.1036576 -0.050375 0.0024227 -0.0687257 0.0900574 0.0087959 0.0408707 0.0257302 0.0852767 0.0802402 0.0616842 0.0668498 0.0548771 0.0225707 -0.0903485 0.040172 -0.0788514 -0.0231476 0.0810048 -0.0593097 -0.1045316 -0.0399833 0.0848792 -0.0080379 -0.1052339 -0.0307312 -0.024021 -0.131866 0.0754288 0.0561748 0.0263376 0.0731278 -0.0171136 0.0465744 -0.0155885 0.0981202 0.0950055 -0.0618656 0.0652038 -0.0476225 -0.0139928 0.0749506 0.0533721 0.0958816 -0.0273976 0.1039578 0.0324643 0.0063591 -0.0006251 -0.1156737 -0.0921292 -0.0239118 -0.0524402 0.0536465 -0.1037502 0.0502784 0.0024009 0.0686394 0.0901095 -0.0087936 0.040838 -0.0257032 0.0852835 0.0803165 -0.0616284 0.0668085 -0.0548334 0.0225701 0.0903625 0.0401487 0.0788442 -0.0231868 unknown
polarizability: 120.7672003|0.0040916|100.6114076|-5.7579382|0.0015664|105.32488 unknown
InChI: InChI=1S/C8H14N4/c1-7(2,5-9)11-12-8(3,4)6-10/h11-12H,1-4H3
charge 0 multiplicity 1
26 atoms
N  -0.434682 0.070442 -0.568083
N  0.434375 0.071009 0.568276
N  -2.836605 1.326425 1.599539
N  2.836124 1.326787 -1.600119
C  -1.84029 -0.337206 -0.275951
C  1.840303 -0.336085 0.27627
C  -1.877943 -1.794031 0.239862
C  -2.644355 -0.181302 -1.591714
C  1.878611 -1.793092 -0.238982
C  2.64422 -0.179283 1.59199
C  -2.429333 0.571061 0.768346
C  2.428785 0.572132 -0.768316
H  -0.397053 0.942285 -1.126397
H  0.396461 0.943365 1.125789
H  -1.224707 -1.897335 1.120851
H  -2.90705 -2.081696 0.515266
H  -1.513943 -2.464565 -0.557425
H  -2.63591 0.863352 -1.952806
H  -3.694201 -0.480895 -1.438326
H  -2.194049 -0.828408 -2.363442
H  1.225387 -1.897034 -1.119906
H  2.907833 -2.080421 -0.514315
H  1.514947 -2.463472 0.558587
H  2.635198 0.865491 1.952731
H  3.69424 -0.478351 1.438756
H  2.194235 -0.826371 2.363918
