program: Gaussian 09
title: 000096394
version: EM64L-G09RevD.01
frameworkgroup: C1[X(C8H15NO3)]
method: RPBEPBE
basis: SDD
operation: Freq
keyword: #p
keyword: freq=noraman
keyword: PBEPBE/SDD
title: #p freq=noraman PBEPBE/SDD
converged: NO YES NO NO
title: Mulliken charges:
elementType: O O O N C C C C C C C C H H H H H H H H H H H H H H H
charge: -0.432894 -0.316619 -0.307115 -0.138778 -0.073865 -0.407213 -0.407232 -0.401371 -0.398590 0.313908 -0.208619 -0.676987 0.215386 0.225755 0.197978 0.195393 0.224597 0.264406 0.215414 0.210737 0.264170 0.323925 0.226147 0.225876 0.211629 0.227645 0.226318
chargesum: 0.00000
title: Mulliken charges with hydrogens summed into heavy atoms:
elementType: O O O N C C C C C C C C
charge: -0.108969 -0.316619 -0.307115 -0.138778 0.141521 0.016521 0.012757 0.078450 0.076317 0.313908 0.243404 -0.011396
polarizability: 1.31135352e+02 4.09039745e-01 9.77443506e+01 -3.27658176e+00 -1.95413475e+00 8.14869139e+01
1716.lowfreq: -12.5759 0.0005 0.0006 0.0007 10.7921 12.8441 35.1318 45.4428 96.7886
frequency: 34.0994 45.3915 96.7823 109.3463 118.6710 174.4591 196.5112 250.5877 271.1877 300.5846 315.0909 336.2164 341.9327 359.9736 454.9538 464.7792 494.1291 550.6141 632.2421 692.3044 765.5888 800.2145 803.1763 809.7869 845.3446 938.3196 958.6614 972.1011 977.2125 1017.6302 1032.8517 1058.8602 1096.0830 1110.9775 1119.9673 1138.8810 1148.2517 1178.6341 1198.9878 1227.4990 1247.3223 1263.1115 1269.9868 1305.1940 1335.3257 1340.6184 1349.9665 1354.1467 1363.1656 1379.3928 1397.9103 1416.1387 1451.4860 1463.7573 1463.8904 1472.0150 1476.5298 1478.4809 1491.2468 1635.8959 2955.5860 2959.5211 2981.1203 2984.8019 2994.6881 3010.1596 3022.6671 3059.6374 3067.3127 3067.5165 3091.2053 3094.6300 3105.9534 3118.9002 3543.5515
redmass: 4.2482 2.2084 4.4570 3.2732 3.5281 3.5695 2.5547 1.1892 1.5038 4.0363 1.7632 2.4058 3.7311 3.8264 1.9266 3.1546 4.0301 4.2418 2.8629 10.9667 5.3357 1.0956 2.2268 1.6051 3.0340 1.8068 2.7198 1.7269 2.5944 2.4706 2.4184 3.3944 2.0324 2.1679 2.7944 1.4559 1.2497 1.5928 2.0414 1.4388 1.1334 2.0049 1.4983 1.2853 1.2633 1.4601 1.3379 1.4407 1.2931 1.2432 1.2918 2.5296 1.0917 1.0617 1.0710 1.0780 1.0552 1.0912 1.0822 10.0095 1.0713 1.0708 1.0628 1.0637 1.0357 1.0582 1.0836 1.0993 1.1039 1.1032 1.0984 1.0931 1.1027 1.0916 1.0658
irintensity: 0.3383 0.1138 5.8072 1.2729 4.2875 3.8716 10.4077 0.6347 29.1844 3.4626 60.9553 15.1200 25.2126 17.6459 4.2264 0.5302 3.9179 8.6876 1.4494 15.9487 15.8326 3.0730 7.0981 6.1996 13.0570 41.2487 21.5367 1.9243 8.7412 217.2312 27.4575 140.4247 57.2332 1.5138 0.4279 5.2290 1.4385 141.6668 19.5035 157.0307 0.0309 33.7894 106.8664 3.2447 3.2506 30.9569 8.2760 2.0120 9.8020 28.9494 52.2975 110.1555 6.3384 29.6749 1.0640 10.9302 5.7578 17.5143 9.6328 412.6058 24.9294 65.8852 15.5060 37.0902 21.6582 26.1200 23.7535 34.6069 17.3576 52.4584 33.9345 4.8654 49.8574 3.7929 6.6665
temp: 298.150 k
press: 1.00000 atm
elementType: 8 8 8 7 6 6 6 6 6 6 6 6 1 1 1 1 1 1 1 1 1 1 1 1 1 1 1
symmnumber: 1
zpe: 600834.7 jmol-1
zpe.correction: 0.228846 hartree
zpe.thermalcorrener: 0.241745 hartree
zpe.thermalcorrenthalpy: 0.242689 hartree
zpe.thermalcorrgfe: 0.188888 hartree
zpe.sumelectzpe: -593.311931 hartree
zpe.sumelectthermal: -593.299032 hartree
zpe.sumelectthermalent: -593.298087 hartree
zpe.sumelectthermalfe: -593.351888 hartree
dipole: 0.8985 -1.8337 -0.0155
dipole: 2.0420
quadrupole: -77.5770 -77.8317 -67.4841
quadrupole: -8.3724 0.9331 2.2613
quadrupole: -3.2794 -3.5341 6.8135 -8.3724 0.9331 2.2613
hfenergy: -593.5407767 hartree
pointgroup: C01 [X(C8H15N1O3)]
dipole: 0.3425835 -0.7266885 -0.0011052 debye
polarizability: 131.171632|-0.0996267|97.7219051|-3.0590882|-1.9790578|81.4730798 unknown
InChI: InChI=1S/C8H15NO3/c1-2-12-8(11)9-5-3-7(10)4-6-9/h7,10H,2-6H2,1H3
charge 0 multiplicity 1
27 atoms
O  -4.048322 -0.806928 -0.670631
O  2.077008 -0.386064 0.081821
O  1.594833 1.881031 -0.313505
N  -0.070893 0.39266 0.416888
C  -2.856522 -0.376493 0.084168
C  -2.348087 1.005333 -0.376022
C  -1.724305 -1.423085 0.019506
C  -1.113771 1.439381 0.449888
C  -0.494187 -0.959035 0.838175
C  1.213477 0.729748 0.039081
C  3.484404 -0.096435 -0.313527
C  4.243703 -1.41631 -0.218672
H  -3.231404 -0.303926 1.122663
H  -3.154357 1.753579 -0.268636
H  -2.068407 0.95773 -1.44815
H  -1.422053 -1.571155 -1.037434
H  -2.090314 -2.391454 0.406955
H  -0.672136 2.369626 0.059767
H  -1.415788 1.616738 1.503967
H  -0.760847 -0.933628 1.916463
H  0.350919 -1.649734 0.71325
H  -3.800669 -0.886044 -1.627807
H  3.485676 0.318398 -1.337632
H  3.889786 0.673826 0.367079
H  5.300759 -1.259956 -0.501489
H  4.215476 -1.815389 0.809744
H  3.81112 -2.170314 -0.89851
