program: Gaussian 09
title: 000096351
version: EM64L-G09RevD.01
frameworkgroup: C1[X(C7H8N2O)]
method: RPBEPBE
basis: SDD
operation: Freq
keyword: #pfreq=noraman
keyword: PBEPBE/SDD
title: #p freq=noraman PBEPBE/SDD
converged: NO YES NO NO
title: Mulliken charges:
elementType: O N N C C C C C C C H H H H H H H H
charge: -0.278351 -0.029629 -0.634242 0.279238 0.162574 -0.259240 -0.285502 -0.476653 -0.769004 0.162427 0.287423 0.239988 0.218587 0.256102 0.231410 0.231340 0.323048 0.340486
chargesum: 0.00000
title: Mulliken charges with hydrogens summed into heavy atoms:
elementType: O N N C C C C C C C
charge: -0.278351 -0.029629 0.029292 0.279238 0.162574 0.028183 -0.045515 -0.258066 -0.050153 0.162427
polarizability: 1.33753390e+02 3.75936282e+00 9.49740866e+01 1.25411258e-02 3.55608907e-03 4.26021255e+01
1716.lowfreq: -27.8562 -15.0938 -8.4501 -3.7338 -0.0001 0.0003 0.0007 5.3742 93.6103
frequency: -27.6662 -15.0699 93.5956 192.2868 261.5491 339.9446 353.6390 388.9717 449.2297 465.7965 493.2366 568.4281 590.2325 631.7508 690.3035 712.5732 753.8080 818.0314 871.1340 906.8427 977.9358 999.4550 1012.9370 1048.5237 1053.6912 1119.2866 1143.9450 1248.6061 1308.7298 1318.4452 1354.2402 1367.3109 1391.7652 1454.7867 1468.3332 1485.8095 1541.1134 1587.4849 1593.7428 1636.4679 2984.7516 3061.8217 3100.8600 3121.8733 3142.7619 3166.9410 3529.7509 3683.7884
redmass: 4.2599 1.0422 3.9092 4.4434 4.0827 3.5546 4.3989 2.5851 2.0500 3.6217 1.4646 4.7929 1.2534 7.8396 4.0169 4.7178 2.7230 5.5447 1.4905 1.5621 1.5533 3.4315 1.3436 1.6136 1.9339 2.0068 1.6055 2.6173 1.8641 8.7155 2.0133 3.7828 1.2733 1.1674 1.0464 2.2484 5.3979 2.3122 6.1490 1.9429 1.0384 1.0970 1.0902 1.0982 1.0895 1.0970 1.0449 1.1041
irintensity: 18.7902 1.2063 0.0021 12.1760 0.9859 2.5960 7.6756 0.0252 7.3962 5.1394 156.5087 6.3862 113.2614 2.2762 7.1290 36.7885 30.4184 0.6087 22.7586 3.5346 4.0230 4.9010 1.9257 11.3082 1.0429 3.1915 26.3001 1.6077 11.0103 25.7146 37.2726 233.6877 31.0555 14.5158 16.1532 21.5830 10.1216 127.4262 64.0410 275.8798 15.2324 17.5515 39.0069 8.8918 7.3695 5.5964 40.9422 33.1097
temp: 298.150 k
press: 1.00000 atm
elementType: 8 7 7 6 6 6 6 6 6 6 1 1 1 1 1 1 1 1
symmnumber: 1
zpe: 367771.0 jmol-1
zpe.correction: 0.140077 hartree
zpe.thermalcorrener: 0.147791 hartree
zpe.thermalcorrenthalpy: 0.148735 hartree
zpe.thermalcorrgfe: 0.107550 hartree
zpe.sumelectzpe: -455.563222 hartree
zpe.sumelectthermal: -455.555507 hartree
zpe.sumelectthermalent: -455.554563 hartree
zpe.sumelectthermalfe: -455.595749 hartree
dipole: 0.9164 -1.5978 0.0302
dipole: 1.8422
quadrupole: -53.3185 -56.6913 -61.0523
quadrupole: 17.0002 -0.0544 0.0091
quadrupole: 3.7022 0.3294 -4.0316 17.0002 -0.0544 0.0091
hfenergy: -455.7032986 hartree
pointgroup: C01 [X(C7H8N2O1)]
dipole: 0.375869 -0.6195703 0.01174 debye
dipolederiv: -0.88759 0.2515669 -0.0007882 0.1192668 -0.8767365 0.0021152 -0.0010484 0.0045607 -0.3753673 -0.6885556 -0.0277381 -0.0003226 -0.2120145 -0.3393126 -0.0002689 -0.0008163 -0.0005663 -0.2446101 -0.717551 -0.4698445 0.0044924 -0.4589054 -0.8626417 0.000725 0.0041969 -0.0012142 -0.7024101 -0.5628293 -0.0073501 -0.0002831 -0.044914 -0.2265297 -0.0000706 0.0006814 -0.0004674 0.0427591 0.8540737 0.040159 -0.0000995 -0.0112861 0.1521019 0.0004993 -0.0002275 0.0004997 0.0304567 0.1827801 -0.0354612 -0.0004264 0.1086032 0.1077629 0.0007133 0.0000456 0.0000414 -0.0799666 -0.4084748 0.1160272 0.0004825 0.3206103 0.0186872 0.0000571 0.000049 0.0004286 -0.1383429 0.2854432 0.0074984 0.0002764 0.0726272 0.2761534 0.001545 0.0025586 0.0017485 -0.0687671 -0.3489022 -0.0178858 0.0000968 -0.1180005 0.0407555 0.0000755 0.0008535 -0.0001262 0.0508135 1.6261687 0.1766616 -0.0012242 0.2639373 1.3921136 -0.0059941 -0.0021631 -0.005948 0.2459924 0.1224846 0.0802233 0.0003354 0.0384404 0.0446005 -0.0005031 0.0008062 -0.0000507 0.1468917 0.0293821 -0.0912544 -0.0001849 -0.1009044 -0.0429363 -0.0005156 -0.0003073 -0.0004078 0.1529919 -0.0119767 -0.1246268 -0.0002656 -0.1489186 -0.0683892 -0.0006858 -0.0012285 -0.0003196 0.1234761 0.0786709 0.0163339 0.0000458 0.118234 -0.063465 -0.0003876 0.0001699 -0.000381 0.1196606 0.0106427 -0.0126288 0.0413929 -0.019645 0.0604285 0.1034453 0.0947566 0.0852194 -0.0358437 0.0107509 -0.0125419 -0.0414868 -0.0193096 0.0611064 -0.1031087 -0.095117 -0.0848276 -0.0366172 0.2266629 0.081818 -0.0013653 0.0741657 0.1459163 0.0013653 -0.0019819 0.0010259 0.3820706 0.1988199 0.0290433 -0.0006757 0.0180133 0.1803849 0.0009935 -0.0012276 0.0007846 0.3868124 unknown
polarizability: 133.5454482|4.7067499|95.1820281|0.0012224|0.0118358|42.6021263 unknown
InChI: InChI=1S/C7H8N2O/c1-5-2-3-6(4-9-5)7(8)10/h2-4H,8H2,1H3
charge 0 multiplicity 1
18 atoms
O  -2.836606 1.127568 -0.008281
N  1.447289 -1.208461 -0.004516
N  -2.88397 -1.185161 0.004587
C  -0.700493 -0.019812 0.000564
C  2.105748 -0.005344 -0.001019
C  -0.008589 1.219568 0.003185
C  1.396012 1.227559 0.002573
C  0.084473 -1.199287 -0.003916
C  3.617479 -0.05228 -0.001578
C  -2.208191 0.023207 0.001685
H  -0.60107 2.140113 0.005671
H  1.951273 2.17146 0.0048
H  -0.371149 -2.198511 -0.008338
H  3.953487 -1.100122 -0.003899
H  4.032916 0.458784 -0.890193
H  4.033519 0.455165 0.888813
H  -2.416451 -2.08815 0.011422
H  -3.902879 -1.153195 0.001039
