program: Gaussian 09
title: 000096344
version: EM64L-G09RevD.01
frameworkgroup: C1[X(C9H16O3)]
method: RPBEPBE
basis: SDD
operation: Freq
keyword: #pfreq=noraman
keyword: PBEPBE/SDD
title: #p freq=noraman PBEPBE/SDD
converged: YES YES NO NO
title: Mulliken charges:
elementType: O O O C C C C C C C C C H H H H H H H H H H H H H H H H
charge: -0.195535 -0.253542 -0.249120 -0.025886 -0.510310 -0.710720 -0.709521 0.206931 -0.607514 0.274930 -0.230840 -0.670608 0.222184 0.286584 0.222455 0.250964 0.212012 0.192694 0.202507 0.217491 0.216904 0.240856 0.275154 0.232928 0.230205 0.213159 0.230606 0.235030
chargesum: 0.00000
title: Mulliken charges with hydrogens summed into heavy atoms:
elementType: O O O C C C C C C C C C
charge: -0.195535 -0.253542 -0.249120 0.196297 -0.001271 -0.055050 -0.072618 0.206931 -0.091504 0.274930 0.232294 0.008186
polarizability: 1.38833296e+02 7.48955906e-02 1.00924203e+02 -1.23253611e+00 2.24908804e+00 8.58056092e+01
1716.lowfreq: -13.2150 0.0004 0.0010 0.0010 2.7781 6.1547 15.3843 33.2450 38.1101
frequency: 7.6414 32.9754 38.0267 54.0412 90.3297 114.0732 144.9760 169.1247 180.4843 208.5297 243.6877 251.8728 287.0774 331.9637 345.0574 389.5107 405.5290 427.4213 481.5894 546.1181 616.8717 705.9259 793.6899 799.6674 812.9448 839.2010 864.9707 915.9767 923.8675 936.7819 958.8379 969.6659 1020.6747 1062.1396 1102.2157 1113.7171 1119.6733 1135.0999 1153.6015 1183.3672 1198.7902 1229.5806 1250.3956 1277.4594 1291.8299 1328.7616 1354.6653 1357.3768 1377.0264 1395.1032 1402.0278 1425.5933 1435.2401 1463.3948 1468.1129 1471.4474 1473.0922 1481.6660 1486.0730 1492.0667 1618.2915 1639.4843 2949.3128 2967.2917 2971.0714 2987.2536 2997.5020 3002.2691 3013.6963 3016.5380 3057.8168 3065.8537 3071.6840 3073.1051 3090.1235 3093.8662 3110.4054 3121.5254
redmass: 3.9608 2.8464 3.8314 3.1919 3.7048 2.7936 3.9312 2.5116 3.0394 1.0413 1.1274 1.3794 4.1862 2.4785 3.0214 2.7293 2.2922 1.9877 3.7575 4.6866 3.8755 4.7050 3.2470 1.1061 3.1646 3.0822 2.2903 1.2965 2.4233 2.3864 1.4802 1.8142 2.2460 2.0040 1.7373 2.3305 2.3693 1.4660 2.6162 1.8173 1.5105 1.4327 1.1380 1.4754 1.4760 1.4433 1.6539 1.4590 1.2127 1.2170 1.2617 1.0965 1.0927 1.0398 1.0541 1.0493 1.0628 1.0553 1.0675 1.0484 9.4403 8.3125 1.0611 1.0360 1.0387 1.0879 1.0359 1.0900 1.0582 1.0629 1.0985 1.0983 1.0992 1.1067 1.0988 1.0985 1.1028 1.0992
irintensity: 1.1277 0.9927 1.5882 1.6030 2.8086 1.1282 0.0539 5.2136 12.3331 0.1070 0.7995 1.6672 2.9036 2.2287 7.5572 4.9694 0.8602 3.3377 0.8785 7.1308 11.9470 5.8611 5.3747 4.4570 0.6001 8.5415 16.7356 11.7061 5.9624 1.4358 5.2994 12.7350 63.9188 58.3352 3.1238 54.7645 311.4005 6.8900 139.7799 1.6658 24.6513 34.0052 1.7126 177.2707 6.6197 12.1452 40.9751 10.7711 27.3641 6.2706 22.0860 31.8214 23.4514 12.1977 7.5599 7.7621 4.6536 5.7221 14.9779 22.4307 231.3880 63.9673 8.4053 30.8358 34.4127 2.7430 19.9622 12.0990 16.0768 5.1459 10.4396 74.0700 56.1910 7.2776 27.7488 27.3056 41.8023 2.6327
temp: 298.150 k
press: 1.00000 atm
elementType: 8 8 8 6 6 6 6 6 6 6 6 6 1 1 1 1 1 1 1 1 1 1 1 1 1 1 1 1
symmnumber: 1
zpe: 617785.8 jmol-1
zpe.correction: 0.235302 hartree
zpe.thermalcorrener: 0.250212 hartree
zpe.thermalcorrenthalpy: 0.251156 hartree
zpe.thermalcorrgfe: 0.190235 hartree
zpe.sumelectzpe: -577.263031 hartree
zpe.sumelectthermal: -577.248121 hartree
zpe.sumelectthermalent: -577.247177 hartree
zpe.sumelectthermalfe: -577.308098 hartree
dipole: 1.8321 0.9355 1.4434
dipole: 2.5130
quadrupole: -60.4533 -81.9941 -71.0696
quadrupole: -0.9376 -3.3840 -4.4498
quadrupole: 10.7190 -10.8217 0.1027 -0.9376 -3.3840 -4.4498
hfenergy: -577.4983332 hartree
pointgroup: C01 [X(C9H16O3)]
dipole: -0.6562586 0.491255 0.5527102 debye
polarizability: 138.50966|-0.2350758|85.5424053|-3.626016|-1.1875051|101.511043 unknown
InChI: InChI=1S/C9H16O3/c1-4-12-9(11)6-8(10)5-7(2)3/h7H,4-6H2,1-3H3
charge 0 multiplicity 1
28 atoms
O  0.835298 0.031462 -2.142699
O  -2.661237 0.668298 -0.186055
O  -1.008686 0.433527 1.43985
C  3.108375 -0.212754 -0.34225
C  1.865769 0.638412 0.003646
C  3.959622 0.452709 -1.450347
C  3.95203 -0.465001 0.929265
C  0.774506 0.663657 -1.057868
C  -0.481976 1.509798 -0.731201
C  -1.36931 0.822509 0.30266
C  -3.636969 -0.01008 0.73068
C  -4.973566 -0.043325 -0.001357
H  2.750013 -1.187212 -0.730071
H  1.380513 0.287451 0.940197
H  2.16378 1.687688 0.219104
H  3.368703 0.601138 -2.370322
H  4.832272 -0.176679 -1.705213
H  4.342139 1.436399 -1.112744
H  4.316098 0.488449 1.359389
H  4.836656 -1.086291 0.697045
H  3.364869 -0.985919 1.70873
H  -0.162855 2.478266 -0.301938
H  -1.055323 1.680611 -1.654072
H  -3.248323 -1.019409 0.955923
H  -3.678985 0.562985 1.674414
H  -5.731677 -0.541392 0.630126
H  -5.3263 0.977271 -0.227605
H  -4.890235 -0.601566 -0.949187
