program: Gaussian 09
title: 000096277
version: EM64L-G09RevD.01
frameworkgroup: C1[X(C9H9ClO3)]
method: RPBEPBE
basis: SDD
operation: Freq
keyword: #p
keyword: freq=noraman
keyword: PBEPBE/SDD
title: #p freq=noraman PBEPBE/SDD
converged: YES YES NO NO
title: Mulliken charges:
elementType: Cl O O O C C C C C C C C C H H H H H H H H H
charge: -0.063578 -0.244337 -0.272772 -0.195065 0.358751 -0.370358 -0.318137 -0.353433 -0.208020 -0.183832 -0.117013 0.216604 -0.495027 0.245219 0.244615 0.250951 0.264504 0.253612 0.257991 0.245732 0.237399 0.246192
chargesum: 0.00000
title: Mulliken charges with hydrogens summed into heavy atoms:
elementType: Cl O O O C C C C C C C C C
charge: -0.063578 -0.244337 -0.272772 -0.195065 0.358751 0.119477 -0.067185 -0.088930 0.045592 0.074159 -0.117013 0.216604 0.234296
polarizability: 1.83915888e+02 6.74274843e-01 1.09197248e+02 7.10530301e-02 -1.24191485e-01 5.45915791e+01
1716.lowfreq: -12.2137 -9.4033 -4.2025 -0.0023 -0.0014 0.0021 9.6007 29.7169 64.2210
frequency: 7.3026 29.6796 64.0997 66.7644 102.5576 133.8311 170.4152 180.6795 221.9056 269.5719 316.1965 330.3304 405.1442 415.8352 478.7548 498.8343 564.5935 613.3058 623.0720 677.1245 698.1178 787.4153 800.8483 826.4332 867.3508 926.4614 946.3012 955.7304 991.2376 1003.3675 1031.3653 1071.2032 1108.6021 1114.0621 1133.7030 1148.9875 1176.0693 1199.0999 1228.3349 1289.7201 1354.0230 1378.2226 1404.3509 1423.6550 1450.6843 1453.2431 1464.3597 1475.9980 1584.6511 1605.6493 1686.8957 2961.2111 3007.6726 3018.0559 3110.8365 3153.8439 3155.4684 3161.5764 3174.7246 3181.3623
redmass: 4.8208 5.5044 1.1602 5.2055 3.6637 5.2215 3.0818 6.7005 8.7868 5.0145 7.1643 5.7317 9.8459 3.0048 5.3350 2.7149 3.2667 7.0525 7.2038 5.5701 3.4555 6.7323 1.3115 1.5208 5.8972 1.3445 6.6312 1.3430 3.9348 1.8671 6.6711 2.5893 1.3149 1.2617 4.2369 1.4295 1.1657 1.0770 4.7602 1.2597 1.8653 3.4267 3.7633 1.1823 1.1508 1.0498 1.0511 2.1237 7.3006 6.7382 10.1383 1.0552 1.0295 1.1041 1.1049 1.1049 1.0879 1.0887 1.0968 1.0979
irintensity: 0.0903 0.0095 0.1614 0.8580 0.0965 6.5622 17.0049 2.4671 1.9668 10.8451 1.3475 9.7500 5.0224 0.0770 0.1964 24.7510 3.9561 12.3685 0.7249 34.5184 0.6112 5.6681 20.4999 74.0166 8.5564 0.0059 4.8596 0.3667 31.8369 0.5168 121.2479 46.1257 28.3561 0.1812 458.5346 0.7618 11.0218 0.7506 183.8964 0.5407 20.2401 0.5417 1.4601 19.0249 108.2604 15.3277 15.0621 154.9872 12.9795 19.7455 174.3188 41.2250 32.1007 17.6841 25.1020 14.3731 9.6872 1.6275 6.6059 0.9493
temp: 298.150 k
press: 1.00000 atm
elementType: 17 8 8 8 6 6 6 6 6 6 6 6 6 1 1 1 1 1 1 1 1 1
symmnumber: 1
zpe: 422765.6 jmol-1
zpe.correction: 0.161023 hartree
zpe.thermalcorrener: 0.174201 hartree
zpe.thermalcorrenthalpy: 0.175145 hartree
zpe.thermalcorrgfe: 0.117468 hartree
zpe.sumelectzpe: -1033.105056 hartree
zpe.sumelectthermal: -1033.091878 hartree
zpe.sumelectthermalent: -1033.090934 hartree
zpe.sumelectthermalfe: -1033.148611 hartree
dipole: -3.1968 -2.6013 -0.0151
dipole: 4.1214
quadrupole: -76.2532 -80.6685 -83.9157
quadrupole: 10.6040 0.0716 -0.2020
quadrupole: 4.0260 -0.3894 -3.6366 10.6040 0.0716 -0.2020
hfenergy: -1033.2660785 hartree
pointgroup: C01 [X(C9H9Cl1O3)]
dipole: -1.2737707 1.0012903 0.0645658 debye
dipolederiv: -0.862119 -0.0915516 -0.0457954 -0.1176331 -0.1435006 -0.0131659 -0.0484475 -0.0119496 -0.0744342 -1.9514919 0.0796433 -0.0685959 0.0539639 -0.2575187 0.0046597 -0.0723586 0.0055103 -0.271379 -1.4772539 0.3281393 -0.0063249 0.5159292 -0.7289978 -0.0363356 0.0201373 -0.0442217 -0.3082716 -0.6781096 -0.1779361 -0.0410012 0.1572155 -0.8715336 -0.0729529 0.0059836 -0.0878332 -0.2982833 1.6911253 0.07657 0.0808545 0.3563887 0.0319134 0.0083389 0.1113461 -0.0048767 0.1105936 0.5439673 -0.2134832 -0.0156101 -0.8051206 0.2021708 -0.0600913 -0.0763668 -0.0319467 0.3763152 -0.2732133 0.0371886 0.0005214 -0.2883734 -0.0396876 0.0051413 -0.0349513 0.0202643 -0.205054 -0.3357412 -0.0364625 -0.0115171 0.1545627 0.0502414 0.0305162 0.0093362 0.0222226 -0.164699 -0.1591969 -0.0935764 -0.0128761 0.0188 0.0607647 0.0175996 -0.0008724 0.012341 -0.0938756 -0.1310785 -0.011968 -0.0026264 -0.0375498 0.0734304 0.0170324 -0.0051809 0.0182009 -0.0979965 1.1383863 0.1843711 0.0756711 0.1584903 -0.0071972 0.0166932 0.0726457 0.0177874 -0.0888446 1.6542484 -0.128139 0.0433514 -0.5296058 1.3493231 0.1337535 -0.015881 0.1506692 0.216045 0.7174532 -0.0781514 0.0096124 0.0432771 0.211648 -0.0068651 0.0261127 -0.0120305 0.2790506 -0.0000207 -0.0075492 -0.0215237 0.1484554 0.0168775 -0.064122 0.0340434 -0.082472 -0.0516671 -0.0018877 -0.0221839 0.0221857 0.1448246 -0.0195657 0.0853018 -0.0003545 0.0884306 -0.0153865 -0.0047885 0.0928806 0.002243 0.1165752 0.010985 -0.0122838 0.0049524 -0.0134726 0.1710989 0.0705548 -0.0592188 -0.011216 -0.0518172 -0.0021011 -0.0214376 -0.0105123 -0.0218988 0.1715571 0.066419 -0.0506497 -0.0099116 -0.0542617 -0.0204943 -0.0224971 -0.010286 -0.0222772 0.1618685 0.0280441 0.0779934 0.002125 0.0690684 0.0216421 -0.0124127 0.001168 -0.0120144 0.1641873 -0.0148764 0.0161392 0.0036275 -0.0743937 0.0802343 -0.084759 -0.0621991 -0.0580186 -0.0787869 -0.0018684 0.0683906 0.0041477 0.1194146 -0.0494228 -0.0198146 0.0113576 -0.0219361 0.1211827 -0.0185523 0.0095536 0.0026587 -0.0982104 0.0307887 0.107701 0.0403276 0.0895219 -0.0232204 unknown
polarizability: 183.6614049|-0.0758465|108.4939575|5.7780651|6.1367353|55.549353 unknown
InChI: InChI=1S/C9H9ClO3/c1-12-9(11)6-13-8-4-2-7(10)3-5-8/h2-5H,6H2,1H3
charge 0 multiplicity 1
22 atoms
Cl 5.295076 0.450582 0.252856
O  -0.624959 -0.627742 -0.133813
O  -3.907863 0.89986 -0.093649
O  -3.295146 -1.338462 -0.372476
C  0.734124 -0.282084 -0.034028
C  -1.591048 0.455355 -0.059904
C  1.223727 1.037216 0.131741
C  1.632442 -1.375499 -0.11151
C  2.618911 1.257384 0.218929
C  3.019799 -1.155549 -0.024052
C  3.496038 0.162826 0.1404
C  -2.986347 -0.147635 -0.197346
C  -5.335837 0.511699 -0.211526
H  -1.528593 0.993491 0.907831
H  -1.440447 1.192956 -0.874762
H  0.550357 1.896687 0.195357
H  1.22621 -2.38281 -0.239371
H  3.008395 2.271515 0.34615
H  3.718371 -1.994879 -0.082924
H  -5.524101 0.050757 -1.195505
H  -5.891723 1.452663 -0.100721
H  -5.601587 -0.204931 0.583324
