program: Gaussian 09
title: 000096283
version: EM64L-G09RevD.01
frameworkgroup: C1[X(C5H8N4O3S2)]
method: RPBEPBE
basis: SDD
operation: Freq
keyword: #p
keyword: freq=noraman
keyword: PBEPBE/SDD
title: #p freq=noraman PBEPBE/SDD
converged: NO YES NO NO
title: Mulliken charges:
elementType: S S O O O N N N N C C C C C H H H H H H H H
charge: 0.937206 0.285145 -0.588002 -0.532923 -0.480024 -0.024187 -0.022598 -0.617068 -0.629383 -0.337076 0.313322 0.275385 -0.375788 -0.824653 0.335081 0.375027 0.343205 0.382053 0.382209 0.278976 0.278975 0.245118
chargesum: 0.00000
title: Mulliken charges with hydrogens summed into heavy atoms:
elementType: S S O O O N N N N C C C C C
charge: 0.937206 0.285145 -0.205792 -0.532923 -0.480024 -0.024187 -0.022598 0.093040 0.095875 -0.337076 0.313322 0.275385 -0.375788 -0.021584
polarizability: 2.30046161e+02 1.85206783e+00 1.53048492e+02 -2.08727613e+00 -1.12441743e+00 7.64211463e+01
1716.lowfreq: -7.9854 -5.0075 0.0008 0.0020 0.0027 3.6864 48.5803 49.9699 82.4208
frequency: 48.5445 49.9631 82.4159 118.4390 132.2349 153.5956 177.0860 185.8121 203.6127 215.5701 230.2114 253.0707 301.9738 306.8226 335.0587 343.1234 354.5330 398.8557 478.9020 509.9114 520.1280 543.0454 562.7544 579.2774 583.4048 647.7497 660.4621 663.7251 688.6200 702.8266 759.1075 812.3959 891.7743 934.2964 944.6351 980.9395 988.6070 1009.1968 1030.7893 1057.8031 1153.7499 1286.1180 1321.1815 1347.0112 1405.2053 1436.0554 1452.1545 1469.5843 1513.2447 1552.1948 1619.3908 1631.9244 3025.0877 3148.7833 3158.1571 3406.7119 3419.9352 3493.2757 3636.3082 3641.2312
redmass: 6.3846 7.8581 4.0209 1.0800 4.7586 6.5429 5.9871 3.9812 8.1039 5.7032 8.6646 7.1924 4.8513 3.3431 2.1690 5.8969 3.4726 10.7592 7.5690 9.3481 9.5433 3.3016 1.2848 2.6370 1.6066 8.3682 3.2311 5.1988 1.3896 1.2300 9.1634 11.9364 5.7969 9.6722 10.1803 1.1816 1.3963 1.2923 2.8592 2.0666 2.3971 4.3299 4.7804 1.1907 6.0463 1.0526 1.0647 4.3203 3.2692 2.5976 1.7675 1.4378 1.0283 1.1039 1.1058 1.0556 1.0552 1.0663 1.0961 1.0962
irintensity: 0.1162 0.2578 3.3271 0.2662 2.3626 3.2792 1.1300 24.2689 0.7914 7.8970 1.2048 10.0337 5.6469 29.0059 37.8362 6.2477 23.9314 72.2675 30.7038 47.0436 123.4726 3.7586 18.2004 38.9993 152.1346 29.0056 15.1387 4.7981 137.1124 84.8526 66.1379 103.1334 38.8123 51.5291 107.9374 6.6578 20.2855 70.1448 6.3173 54.7422 0.8211 233.4388 54.7346 10.6493 28.4836 14.8209 46.6227 480.1565 137.7156 162.5724 654.9397 225.7661 21.2295 10.1527 10.8563 81.0537 149.9026 52.2257 104.2007 78.5627
temp: 298.150 k
press: 1.00000 atm
elementType: 16 16 8 8 8 7 7 7 7 6 6 6 6 6 1 1 1 1 1 1 1 1
symmnumber: 1
zpe: 386146.1 jmol-1
zpe.correction: 0.147075 hartree
zpe.thermalcorrener: 0.162462 hartree
zpe.thermalcorrenthalpy: 0.163406 hartree
zpe.thermalcorrgfe: 0.104566 hartree
zpe.sumelectzpe: -1434.918360 hartree
zpe.sumelectthermal: -1434.902974 hartree
zpe.sumelectthermalent: -1434.902030 hartree
zpe.sumelectthermalfe: -1434.960869 hartree
dipole: -0.9855 -2.5054 -1.5368
dipole: 3.1000
quadrupole: -96.1050 -81.9580 -104.9170
quadrupole: 3.1692 -6.9067 2.5787
quadrupole: -1.7783 12.3687 -10.5904 3.1692 -6.9067 2.5787
hfenergy: -1435.0654355 hartree
pointgroup: C01 [X(C5H8N4O3S2)]
dipole: 0.4779115 0.9588773 -0.5828124 debye
dipolederiv: 2.0896878 -0.1383159 0.0533328 -0.3813864 1.2910937 -0.1242257 0.0751736 -0.127249 1.4951959 -0.8308326 -0.0738773 -0.0898224 0.1351715 0.0791837 0.0136817 -0.1029711 -0.0155493 -0.072343 -0.6586967 0.1471356 -0.1883376 0.3282526 -0.8001248 0.2718207 -0.4019015 0.2575012 -0.7837862 -0.7695068 -0.0755507 -0.0100745 -0.1593272 -0.6648481 -0.0508087 0.007199 -0.1083966 -0.4849828 -0.7455027 0.0701847 0.0422556 0.1920843 -0.4473935 -0.106735 0.1599324 -0.0336931 -0.5874168 -1.3914309 0.5110789 -0.1384421 0.4740724 -0.9789068 0.0766265 -0.1911761 0.1590732 -0.205826 -1.6700306 -0.5205651 -0.1508182 -0.2880209 -0.8368005 -0.0479074 -0.1958857 -0.1101597 -0.2252321 -0.4238584 0.3577956 0.0427097 0.2364269 -1.2009987 0.079585 0.0416681 -0.0200614 -0.5474878 -0.6273032 -0.5193337 0.0043871 -0.405511 -1.1046297 -0.0825004 -0.0036504 -0.0479666 -0.616558 -0.6701714 -0.0730078 -0.0540342 -0.1115377 -0.8741315 -0.0071743 0.1084981 -0.0470252 -0.2867926 1.0639113 -0.3942073 0.0932931 0.2202136 1.4500587 -0.1254161 0.1089563 -0.1814921 0.2521889 1.1718796 0.6070501 0.130698 -0.1955979 1.476317 0.0715145 0.0167562 0.1337043 0.237864 2.159763 0.0599115 0.2714854 -0.1325949 1.0188872 -0.0211336 0.3769478 -0.0070241 0.0500487 0.1164151 0.103886 0.0093711 0.1148566 0.0686203 0.0148498 0.012403 0.0215006 0.0464025 0.1568182 -0.005377 -0.0364207 -0.0148324 0.3012132 0.0081908 -0.0396099 0.0268668 0.3400904 0.3411656 -0.0280442 -0.031369 -0.0043033 0.2638758 -0.0103003 0.0208653 0.0641208 0.2891537 0.161666 0.0375398 -0.0234597 0.0519491 0.3180286 0.0051628 -0.0168783 0.0020585 0.366391 0.3299755 -0.0605817 -0.0296601 0.0024977 0.3253994 0.0178729 -0.0085527 0.0032697 0.3498499 0.1462782 -0.0308998 0.1110509 0.0627538 0.2778223 0.0326064 0.0416483 0.0294048 0.2940902 0.0807415 0.0242802 0.0725689 -0.0562254 -0.0249188 -0.0865749 0.0570149 -0.0543263 -0.005153 0.109307 0.0101112 -0.0450772 -0.0736559 -0.0239945 0.0706196 -0.0288051 0.0575895 -0.0305609 -0.1402754 -0.009213 -0.0336372 0.0047142 0.086247 0.0002459 -0.0376321 -0.0021459 0.1248639 unknown
polarizability: 228.9837847|-1.9360377|153.0663419|12.8851953|0.0673648|77.4656732 unknown
InChI: InChI=1S/C5H8N4O3S2/c1-13-5-8-3(6)2(4(7)9-5)14(10,11)12/h10H,6-7H2,1H3
charge 0 multiplicity 1
22 atoms
S  -2.49003 0.190784 0.144416
S  3.753306 -0.742459 0.463037
O  -2.691737 1.504179 -1.227423
O  -3.279903 -1.167527 -0.287273
O  -2.966296 0.946626 1.492568
N  1.56457 0.870065 0.134974
N  1.238315 -1.54545 0.092705
N  -0.215832 2.352942 -0.15592
N  -0.860058 -2.528612 -0.138124
C  -0.673557 -0.060905 -0.005625
C  0.211617 1.067292 -0.007115
C  -0.121799 -1.389794 -0.024023
C  1.988318 -0.418854 0.210077
C  4.427201 1.011062 0.546653
H  0.487999 3.087364 -0.107549
H  -1.166835 2.543228 -0.492681
H  -0.356675 -3.413617 -0.101334
H  -1.875999 -2.480777 -0.281691
H  -3.655512 1.771504 -1.222252
H  3.975399 1.544752 1.393896
H  4.206802 1.538347 -0.391484
H  5.513306 0.897448 0.688669
