program: Gaussian 09
title: 000096254
version: EM64L-G09RevD.01
frameworkgroup: C1[X(C8H5ClO4)]
method: RPBEPBE
basis: SDD
operation: Freq
keyword: #p
keyword: freq=noraman
keyword: PBEPBE/SDD
title: #p freq=noraman PBEPBE/SDD
converged: YES YES NO NO
title: Mulliken charges:
elementType: Cl O O O O C C C C C C C C H H H H H
charge: -0.014297 -0.390760 -0.437567 -0.194907 -0.233139 0.385905 0.111436 -0.268664 -0.327511 -0.214924 -0.203588 0.076603 0.130734 0.286967 0.266593 0.246085 0.388417 0.392619
chargesum: 0.00000
title: Mulliken charges with hydrogens summed into heavy atoms:
elementType: Cl O O O O C C C C C C C C
charge: -0.014297 -0.002343 -0.044949 -0.194907 -0.233139 0.385905 0.111436 -0.268664 -0.040544 0.051669 0.042497 0.076603 0.130734
polarizability: 1.37328300e+02 -1.89959364e+00 1.30043698e+02 -7.17815759e-01 1.74103955e+00 5.43444997e+01
1716.lowfreq: -0.0030 -0.0025 -0.0021 2.3291 4.3527 7.8513 35.9302 67.1798 110.8056
frequency: 35.9180 67.1781 110.8053 146.0633 157.3994 159.3440 188.3419 281.3450 301.9446 360.2267 396.3450 402.2491 471.8442 501.8230 562.2254 581.6055 589.7112 599.4706 628.6322 700.2012 703.7253 755.2380 761.2464 806.1964 817.0951 933.4058 996.5430 1003.1294 1034.5039 1073.6257 1122.1671 1167.3672 1174.3507 1206.9126 1306.7395 1325.2583 1373.3588 1425.8133 1449.2147 1567.7091 1597.2371 1642.0932 1657.1504 3154.6704 3175.3103 3190.6429 3511.7502 3534.9423
redmass: 11.1568 8.7167 9.2250 8.9683 11.8331 6.9860 4.8744 8.9564 8.6678 5.5853 9.0527 6.8991 3.7791 4.1621 3.0962 1.5196 3.9818 1.4347 4.7776 5.3362 6.9445 5.8788 2.1891 7.8871 2.1214 1.3862 1.3685 5.8115 4.0846 2.1391 2.4580 1.6178 1.4442 1.5219 2.5137 2.5098 11.4464 2.4742 3.4684 7.4085 7.4592 9.0576 10.1654 1.0881 1.0946 1.0974 1.0639 1.0643
irintensity: 1.2911 0.1992 2.5623 1.1545 1.0779 3.9855 0.2582 0.6214 2.3964 1.4289 7.2948 5.8456 3.4050 18.1814 14.1003 120.5991 58.5767 110.6093 51.0174 62.4165 28.2732 11.7368 67.2091 25.4404 16.3830 0.3078 5.6970 164.5166 173.0279 32.9860 234.6190 36.5654 42.8977 1.1434 59.1811 113.8207 3.4485 26.3996 27.0144 22.4729 19.7991 218.6233 228.7951 5.0551 2.2848 3.3474 39.6008 59.3780
temp: 298.150 k
press: 1.00000 atm
elementType: 17 8 8 8 8 6 6 6 6 6 6 6 6 1 1 1 1 1
symmnumber: 1
zpe: 303313.6 jmol-1
zpe.correction: 0.115526 hartree
zpe.thermalcorrener: 0.127217 hartree
zpe.thermalcorrenthalpy: 0.128161 hartree
zpe.thermalcorrgfe: 0.076684 hartree
zpe.sumelectzpe: -1067.889995 hartree
zpe.sumelectthermal: -1067.878305 hartree
zpe.sumelectthermalent: -1067.877360 hartree
zpe.sumelectthermalfe: -1067.928838 hartree
dipole: -1.5636 3.2891 1.4208
dipole: 3.9092
quadrupole: -70.7797 -70.6102 -86.3379
quadrupole: 0.4562 1.0085 -5.8977
quadrupole: 5.1295 5.2991 -10.4287 0.4562 1.0085 -5.8977
hfenergy: -1068.0055214 hartree
pointgroup: C01 [X(C8H5Cl1O4)]
dipole: 0.260918 -1.4219419 0.5247964 debye
dipolederiv: -0.5263735 0.2756475 -0.0097792 0.3297898 -0.3139407 -0.0000125 -0.0024137 -0.0003091 -0.0357763 -0.3909194 0.0321639 -0.0686487 -0.0031074 -0.5140322 -0.4162071 -0.0478346 -0.4292836 -1.0323394 -1.0205197 0.5216216 -0.0274321 0.5877018 -0.69818 0.0237621 -0.0301519 0.0197105 -0.4239807 -0.3300034 -0.0225472 0.0083922 -0.0394708 -0.7726173 0.2857435 -0.0348726 0.0097108 -0.8363655 -0.841272 -0.1597342 -0.0179063 -0.1103316 -0.9081268 -0.0031154 -0.0224201 -0.0124239 -0.2864909 -0.0662469 0.1836118 -0.0106309 -0.0214699 -0.2014282 -0.035247 -0.0018092 0.015965 -0.0486603 -0.5709254 -0.1604511 -0.027312 -0.2425501 0.0210349 0.0047072 -0.0178456 -0.0188202 0.0256299 0.7409885 -0.5368764 0.0182341 -0.670719 0.3322798 0.0013753 0.0082003 -0.0071955 -0.0577768 0.0474559 -0.0833788 0.0036923 0.0962855 -0.0905934 0.0041103 0.0025002 -0.0187419 -0.1055326 -0.0827122 0.082631 0.0029607 0.1823759 -0.0786189 0.0010748 0.0033086 -0.0082545 -0.0716768 -0.077021 0.0834927 0.001484 0.0763597 0.1304677 0.0086725 0.002817 0.0101411 -0.1418784 0.4638485 0.0251604 0.0694881 0.155441 1.287235 0.0720449 0.0717396 0.2974134 1.585526 1.8966726 -0.0742846 0.0653762 -0.1168157 1.3397193 -0.012972 0.0617814 0.0094633 0.2401199 0.0728576 0.0600583 -0.0016762 0.0556741 0.0623446 0.0002658 0.0008203 0.0016639 0.1653471 -0.0138603 -0.0422999 -0.0055629 -0.0266754 0.0910164 -0.0015031 -0.0053524 0.0013924 0.1605317 0.0667421 -0.0274768 -0.0030749 -0.0367322 -0.0818207 -0.0052466 -0.0036658 -0.0039392 0.1601032 0.3449338 -0.0532563 0.0054417 -0.0446576 0.1650979 0.0772905 0.0155928 0.1366881 0.3023158 0.2863547 -0.1040818 -0.0030463 -0.1710984 0.2301628 -0.0047435 -0.0003943 -0.0031806 0.400904 unknown
polarizability: 135.862437|-3.4231335|131.4167283|3.3057782|0.4395509|54.4373322 unknown
InChI: InChI=1S/C8H5ClO4/c9-5-3-1-2-4(7(10)11)6(5)8(12)13/h1-3,10,12H
charge 0 multiplicity 1
18 atoms
Cl -3.114999 0.960487 -0.057149
O  -0.031519 2.254922 1.278258
O  2.981794 -1.276863 0.122466
O  -0.09451 2.455984 -1.041728
O  2.431538 0.976588 0.087393
C  -0.404127 0.262083 0.008295
C  0.650722 -0.697746 0.029007
C  -1.729628 -0.217858 -0.042028
C  0.36103 -2.084574 -0.004404
C  -2.031519 -1.593554 -0.072936
C  -0.974565 -2.529415 -0.055509
C  -0.138192 1.751456 -0.014987
C  2.062022 -0.220999 0.081439
H  1.191471 -2.793949 0.010721
H  -3.074419 -1.920832 -0.108315
H  -1.19967 -3.599893 -0.081536
H  0.168039 3.230021 1.238201
H  3.90193 -0.900361 0.15081
