program: Gaussian 09
title: 000096234
version: EM64L-G09RevD.01
frameworkgroup: C1[X(C8H5ClS)]
method: RPBEPBE
basis: SDD
operation: Freq
keyword: #p
keyword: freq=noraman
keyword: PBEPBE/SDD
title: #p freq=noraman PBEPBE/SDD
converged: NO NO NO NO
title: Mulliken charges:
elementType: Cl S C C C C C C C C H H H H H
charge: -0.039759 0.266393 0.662087 -0.393530 -0.132477 -0.363379 -0.252768 -0.545840 -0.220313 -0.233620 0.257271 0.246405 0.285131 0.231670 0.232730
chargesum: 0.00000
title: Mulliken charges with hydrogens summed into heavy atoms:
elementType: Cl S C C C C C C C C
charge: -0.039759 0.266393 0.662087 -0.393530 -0.132477 -0.106108 -0.006364 -0.260709 0.011357 -0.000889
polarizability: 1.42664710e+02 -7.54658255e+00 1.32197404e+02 8.79312087e-04 1.90341436e-04 4.04233929e+01
1716.lowfreq: -6.7572 -2.0562 -0.0039 -0.0032 -0.0022 11.3557 129.0622 173.6022 197.5304
frequency: 129.0592 173.5990 197.5268 238.6251 350.3096 390.7801 416.4138 473.3637 486.0936 533.9469 589.6428 678.6230 721.4752 728.8187 760.6070 768.9170 770.4396 868.9833 927.6628 951.2354 988.7534 1016.7621 1035.2723 1127.8866 1149.5021 1176.2793 1259.7441 1319.4531 1389.6202 1425.1921 1451.3056 1517.5562 1572.8932 1603.0143 3134.5228 3144.6186 3157.0711 3170.5629 3246.8492
redmass: 5.0164 9.4617 4.7623 7.3498 11.4276 11.2936 3.0834 4.2857 8.6627 7.2223 3.8240 6.6054 6.9056 2.4656 1.2922 5.8974 1.6166 1.3870 5.9917 1.3772 1.3214 2.5276 3.6291 1.5599 1.3000 1.1138 1.5330 2.6392 5.6264 2.6158 2.9459 6.9777 7.0951 6.8657 1.0854 1.0894 1.0954 1.1006 1.0968
irintensity: 0.1505 0.6350 4.7918 0.0308 2.6897 1.1064 8.3509 1.2572 1.4354 0.1052 0.0029 9.7237 16.5493 42.0353 0.9801 21.4683 104.6605 3.4632 35.4985 2.8452 0.0946 12.6597 10.3689 0.0144 2.5862 1.0149 13.0076 37.7177 2.2671 19.2309 5.0136 4.1949 2.4300 2.6684 0.8534 4.3013 13.4026 21.1105 5.2555
temp: 298.150 k
press: 1.00000 atm
elementType: 17 16 6 6 6 6 6 6 6 6 1 1 1 1 1
symmnumber: 1
zpe: 269416.9 jmol-1
zpe.correction: 0.102615 hartree
zpe.thermalcorrener: 0.110586 hartree
zpe.thermalcorrenthalpy: 0.111530 hartree
zpe.thermalcorrgfe: 0.069155 hartree
zpe.sumelectzpe: -1165.278342 hartree
zpe.sumelectthermal: -1165.270371 hartree
zpe.sumelectthermalent: -1165.269427 hartree
zpe.sumelectthermalfe: -1165.311803 hartree
dipole: 1.4581 0.1470 0.0002
dipole: 1.4655
quadrupole: -64.6489 -66.2304 -76.6121
quadrupole: -3.7516 0.0000 0.0001
quadrupole: 4.5149 2.9334 -7.4483 -3.7516 0.0000 0.0001
hfenergy: -1165.3809575 hartree
pointgroup: C01 [X(C8H5Cl1S1)]
dipole: 0.5359292 -0.2125905 -0.0000668 debye
dipolederiv: -0.3378283 0.2643278 0.0000223 0.3353341 -0.5026076 -0.0000321 0.0000297 -0.000036 -0.0303745 -0.2211866 0.0941013 -0.0000053 -0.0957952 -0.2908416 -0.0000079 -0.0000205 -0.0000206 0.1064397 0.017026 0.1688768 0. 0.0782798 -0.3348311 -0.0000177 -0.0000056 -0.0000248 0.0938254 0.2119708 0.3479567 0.0000235 0.3675522 0.1974826 0.0000149 0.0000171 0.0000214 -0.1256087 0.4951585 -0.5185108 -0.0000406 -0.5324377 0.5504917 0.0000639 -0.0000462 0.0000654 -0.07841 0.0424709 -0.0841674 -0.0000014 -0.009027 0.03181 -0.0000124 -0.0000055 0.0000053 -0.1528656 -0.0609188 -0.1240771 -0.0000093 -0.1569137 -0.0119567 0.0000052 -0.000003 0.0000184 -0.1128394 -0.1976659 -0.2548861 0.0000131 -0.1172913 0.1887772 -0.0000076 0.0000232 0.0000009 -0.2573281 -0.0332668 0.1391543 0.0000088 0.0991466 0.0459596 -0.0000002 0.0000223 0.0000072 -0.1561434 0.0330489 -0.0569604 -0.0000114 -0.0044422 0.0563427 -0.0000042 -0.0000263 -0.0000146 -0.1695271 0.0700904 0.0664282 -0.000003 0.0264546 -0.0266092 0.0000048 0.0000034 -0.0000073 0.1664102 0.0676507 0.0274019 0.0000037 0.0755203 -0.0471137 -0.0000028 0.0000063 -0.0000112 0.1662567 0.036528 0.0045709 -0.0000053 0.0238818 0.096824 -0.0000043 -0.0000028 -0.0000072 0.2223212 -0.0020872 -0.0991892 -0.0000014 -0.1085755 -0.0379966 0.0000014 -0.0000076 0.0000002 0.1619239 -0.1209904 0.0249731 0.0000062 0.0183131 0.0842686 -0.000001 0.0000154 0.0000031 0.1659197 unknown
polarizability: 145.8530193|3.662319|129.0090943|-0.0007937|0.0004237|40.4233929 unknown
InChI: InChI=1S/C8H5ClS/c9-7-5-10-8-4-2-1-3-6(7)8/h1-5H
charge 0 multiplicity 1
15 atoms
Cl -2.627557 1.827478 0.0001
S  -0.9171 -2.230772 -0.000034
C  -0.175776 0.364869 -0.000037
C  0.381659 -0.953429 0.000023
C  -1.626698 0.32028 -0.00002
C  0.692924 1.487061 -0.000091
C  1.773847 -1.169087 -0.000001
C  -2.178451 -0.9369 -0.000032
C  2.083405 1.277014 -0.000054
C  2.621973 -0.041134 -0.000025
H  0.269462 2.496864 -0.000114
H  2.190223 -2.181738 -0.000033
H  -3.230497 -1.212458 -0.000077
H  2.763569 2.135484 -0.000046
H  3.707915 -0.18353 -0.000059
