program: Gaussian 09
title: 000096219
version: EM64L-G09RevD.01
frameworkgroup: C1[X(C8H7ClN2O2)]
method: RPBEPBE
basis: SDD
operation: Freq
keyword: #p
keyword: freq=noraman
keyword: PBEPBE/SDD
title: #p freq=noraman PBEPBE/SDD
converged: NO YES NO NO
title: Mulliken charges:
elementType: Cl O O N N C C C C C C C C H H H H H H H
charge: -0.038501 -0.202860 -0.211589 -0.470347 -0.638468 0.266233 -0.335985 -0.347598 0.203827 -0.204396 -0.213605 -0.098017 0.276331 0.280606 0.236869 0.263292 0.260492 0.310974 0.313961 0.348779
chargesum: 0.00000
title: Mulliken charges with hydrogens summed into heavy atoms:
elementType: Cl O O N N C C C C C C C C
charge: -0.038501 -0.202860 -0.211589 -0.159373 0.024271 0.266233 -0.055378 -0.110729 0.203827 0.058896 0.046887 -0.098017 0.276331
polarizability: 1.89845858e+02 1.40804452e+00 1.09020139e+02 -2.87942613e+00 1.72449776e+00 5.83679133e+01
1716.lowfreq: -6.1175 -0.0025 -0.0015 0.0008 2.1720 10.6018 42.1739 45.3297 75.3043
frequency: 42.1458 45.2357 75.2858 85.7303 136.1673 207.8723 225.6943 267.0100 301.8284 374.2764 408.2877 415.4459 444.8877 466.0931 523.5033 556.0493 562.4215 583.7294 622.6308 670.8459 705.5534 716.6049 747.7155 827.5078 848.6860 864.5650 902.1957 958.2040 983.0561 999.5048 1055.0397 1073.5055 1096.0087 1115.1700 1186.2119 1222.7355 1294.3870 1302.8528 1369.2170 1393.5946 1427.9166 1475.2054 1574.4241 1595.6962 1604.7521 1623.9445 1694.2059 3132.0258 3156.0584 3171.4745 3176.3266 3524.8804 3531.6635 3680.9327
redmass: 8.1649 4.4340 6.2579 9.3287 5.9368 9.6494 9.7306 8.0608 6.5348 3.4062 3.0363 2.4631 1.8473 4.1067 4.4136 2.8004 1.2759 1.2698 6.3806 5.2156 6.0870 6.8158 3.8532 1.3963 1.5144 7.0143 4.0546 1.3933 1.3844 4.0299 1.9984 2.9948 2.4356 1.5207 1.1300 2.4359 1.2667 4.0648 5.3119 3.9768 2.1723 2.4006 7.6202 5.7981 1.2582 5.4012 6.5758 1.0892 1.0890 1.0954 1.0974 1.0551 1.0668 1.1040
irintensity: 6.5082 6.6926 1.6044 2.8670 4.3274 0.9400 1.2309 0.5161 1.4245 4.5153 4.3704 25.4868 74.9673 20.6365 16.4124 74.6702 204.7915 42.2345 1.1184 10.2104 44.9628 15.2174 53.1465 12.9268 28.3171 25.7877 14.4170 1.1715 4.3403 46.4165 21.2187 44.9900 91.5602 4.8378 20.1226 350.2088 1.4557 63.1002 3.4411 18.2048 856.4448 14.7368 6.9906 106.7238 43.1653 81.6206 383.5340 10.0849 0.0690 3.2639 1.5608 30.3315 27.2586 34.9106
temp: 298.150 k
press: 1.00000 atm
elementType: 17 8 8 7 7 6 6 6 6 6 6 6 6 1 1 1 1 1 1 1
symmnumber: 1
zpe: 371123.3 jmol-1
zpe.correction: 0.141353 hartree
zpe.thermalcorrener: 0.153401 hartree
zpe.thermalcorrenthalpy: 0.154345 hartree
zpe.thermalcorrgfe: 0.101465 hartree
zpe.sumelectzpe: -1028.157001 hartree
zpe.sumelectthermal: -1028.144954 hartree
zpe.sumelectthermalent: -1028.144010 hartree
zpe.sumelectthermalfe: -1028.196889 hartree
dipole: -0.6296 -5.3921 3.3645
dipole: 6.3868
quadrupole: -87.9081 -77.2697 -82.5586
quadrupole: -20.8512 12.9478 0.8540
quadrupole: -5.3293 5.3091 0.0202 -20.8512 12.9478 0.8540
hfenergy: -1028.2983547 hartree
pointgroup: C01 [X(C8H7Cl1N2O2)]
dipole: -0.2513949 -2.2063062 1.1759788 debye
dipolederiv: -0.9261752 -0.1196271 0.0020521 -0.1420277 -0.1292015 -0.0200363 0.0028558 -0.0181179 -0.0669131 -0.7218574 -0.1670975 -0.0335627 0.044535 -0.8764874 0.0251935 -0.1158051 0.0018375 -0.3078162 -0.8999023 -0.0821206 0.1667184 -0.1744034 -0.5431581 0.2721432 0.1564647 0.2961477 -0.6232856 -2.0309802 0.5847575 -0.0052335 0.6487834 -0.6274246 0.0258771 0.0581533 -0.0115919 -0.4400545 -0.7717566 0.2863553 -0.3111307 0.4193655 -1.0494302 0.1131757 -0.3452795 0.0715742 -0.6181458 -0.6216707 -0.0369661 0.0052597 -0.0996969 -0.1097046 0.0003204 -0.0062095 -0.0130629 -0.0251987 0.1238945 0.0949399 0.0193021 -0.1353536 0.0440328 0.0632322 -0.0176832 0.0257456 -0.0850991 0.1145705 -0.0268295 -0.0454039 0.1924226 0.0081347 0.0662307 -0.059541 0.0805891 -0.093403 2.0156392 -0.1403837 0.0705717 -0.6554452 1.3218398 -0.0496817 0.2426373 -0.0587234 0.24003 -0.3434829 -0.1794037 -0.0562234 -0.2027513 -0.0668889 0.0264726 -0.0587719 0.0246901 -0.0894666 -0.4879265 0.0283398 0.0354774 0.1016872 -0.0000907 0.0361333 0.0662072 0.0424603 -0.087325 1.3607361 0.1953117 -0.0137238 0.178526 0.1692935 0.0756956 -0.0280552 0.0737901 -0.0284071 2.432509 -0.4999024 -0.0329091 -0.1843027 1.0398591 -0.6609393 -0.0431625 -0.6185869 0.890594 0.1082286 -0.058529 -0.0182329 -0.0146971 0.0384038 -0.0501185 -0.0244703 -0.0330992 0.1412854 0.0010081 0.0886593 0.0467959 0.0917324 0.0204337 -0.0562557 0.0628461 -0.0501767 0.1182314 0.0237408 0.061864 0.0317503 0.0569124 0.0498193 -0.0480611 0.0311543 -0.0492594 0.1445288 0.0618021 -0.049849 -0.0134602 -0.0538611 0.0086025 -0.0610746 -0.0104963 -0.0623587 0.1413808 0.1611894 -0.0158236 0.0449993 -0.0674711 0.1034166 0.04931 -0.0143619 0.0694467 0.3044846 0.1873144 0.0316132 0.063259 -0.0243828 0.3125275 0.0917204 0.0755757 0.1254035 0.2105582 0.2131193 0.0046914 0.0436945 0.0204286 0.2860226 0.1006626 0.027942 0.1032921 0.2740214 unknown
polarizability: 189.7833644|1.0188859|108.5153532|-4.2805448|5.2327089|58.9351931 unknown
InChI: InChI=1S/C8H7ClN2O2/c9-6-3-1-5(2-4-6)7(12)11-8(10)13/h1-4,11H,10H2
charge 0 multiplicity 1
20 atoms
Cl -4.982056 -0.533053 -0.023295
O  1.472526 1.767963 -0.037803
O  3.89841 0.271052 -0.93957
N  1.911594 -0.538655 0.09366
N  3.983322 -1.555537 0.511087
C  -0.416601 0.248416 -0.013538
C  -1.319103 1.256697 0.412998
C  -0.931824 -0.994732 -0.467129
C  1.05348 0.58256 -0.002123
C  -2.709017 1.026666 0.417416
C  -2.322526 -1.237663 -0.475966
C  -3.1902 -0.223857 -0.023249
C  3.325438 -0.526811 -0.162377
H  -0.911185 2.221735 0.730291
H  -0.264214 -1.76806 -0.865388
H  -3.404894 1.800933 0.752463
H  -2.723665 -2.188247 -0.838596
H  1.488294 -1.43431 0.346967
H  3.582012 -2.036347 1.314633
H  4.978309 -1.663648 0.322821
