program: Gaussian 09
title: 000096241
version: EM64L-G09RevD.01
frameworkgroup: C1[X(C7H14O6)]
method: RPBEPBE
basis: SDD
operation: Freq
keyword: #pfreq=noraman
keyword: PBEPBE/SDD
title: #p freq=noraman PBEPBE/SDD
converged: YES YES NO NO
title: Mulliken charges:
elementType: O O O O O O C C C C C C C H H H H H H H H H H H H H H
charge: -0.284913 -0.302762 -0.452139 -0.450494 -0.419593 -0.434753 -0.088188 -0.121546 -0.049286 -0.114126 -0.118473 -0.363459 -0.509366 0.224819 0.219420 0.240185 0.224086 0.240680 0.188230 0.252734 0.360890 0.360275 0.357172 0.258801 0.204325 0.224952 0.352531
chargesum: 0.00000
title: Mulliken charges with hydrogens summed into heavy atoms:
elementType: O O O O O O C C C C C C C
charge: -0.284913 -0.302762 -0.091249 -0.090219 -0.062421 -0.082223 0.136631 0.097874 0.190899 0.109960 0.122208 0.077505 0.178711
polarizability: 1.09889166e+02 -4.24124943e-01 1.03506199e+02 -1.07588781e+00 1.01451270e+00 7.37435730e+01
1716.lowfreq: -14.3144 -4.3571 0.0005 0.0006 0.0007 10.5655 56.0924 73.2413 98.4367
frequency: 56.0800 73.2231 98.4287 105.8143 129.3579 163.5560 175.2489 207.4515 241.9425 253.1636 271.2931 296.7287 321.9483 343.9388 366.6199 400.4191 413.9588 444.0870 462.1729 472.1115 487.9268 531.9851 574.0099 587.5214 594.9959 831.3297 881.1995 949.5766 966.1828 977.7846 992.5050 1014.6318 1032.9889 1044.2957 1050.6836 1061.6849 1077.9370 1089.2889 1116.8659 1122.2180 1156.8931 1174.2364 1190.9949 1216.5232 1236.9065 1253.9435 1270.3417 1280.9526 1298.7561 1315.4052 1333.2737 1343.1838 1348.0517 1376.8633 1378.8478 1387.7867 1398.7508 1437.1515 1453.0093 1463.1670 1483.7388 2947.6459 2954.0951 2958.7297 2960.5138 2967.3135 2989.4836 3014.0103 3069.9309 3109.8481 3118.7458 3519.0802 3523.6330 3539.7202 3540.1911
redmass: 5.0073 5.5053 3.9815 2.3695 5.7338 1.4417 2.4404 4.0278 4.1501 3.6537 3.4641 3.4071 4.5558 1.5661 4.0486 4.4985 3.1872 1.3474 1.2190 1.7219 1.6200 3.3374 4.8291 3.3961 3.3465 2.8795 4.3077 4.0149 6.6231 5.8023 5.2139 2.4465 4.3184 4.1909 2.6018 3.0674 2.8864 5.2131 2.0790 1.2716 1.3906 1.2692 1.2880 1.2930 1.2293 1.1843 1.2727 1.2782 1.2895 1.2315 1.2825 1.2967 1.3922 1.1788 1.3235 1.4083 1.8187 1.1447 1.0517 1.0817 1.0531 1.0813 1.0826 1.0709 1.0373 1.0841 1.0841 1.0864 1.0944 1.0938 1.1048 1.0649 1.0655 1.0649 1.0654
irintensity: 0.2919 2.5539 5.6784 2.6115 2.2029 1.2707 0.8666 0.7150 28.0073 2.3719 5.1778 36.6179 18.2335 51.6170 10.6232 5.8426 7.5960 122.5350 215.2938 147.7054 60.7304 49.8886 5.1278 4.5857 21.9171 60.1398 22.7178 37.8679 34.6037 195.6204 149.9970 33.5816 98.3637 77.7308 20.2302 123.9695 29.5010 29.6701 2.3400 0.8072 5.3277 19.4448 21.1432 4.9131 37.3196 9.7836 8.5352 32.0459 14.4633 17.4333 23.4179 1.1797 12.0545 30.9291 9.9780 17.3807 27.2419 4.6041 10.7113 5.7727 15.0594 5.6910 1.3416 35.7451 59.0689 46.2693 81.6607 58.3788 38.8872 9.4639 19.1286 19.2498 14.3311 20.5447 4.8458
temp: 298.150 k
press: 1.00000 atm
elementType: 8 8 8 8 8 8 6 6 6 6 6 6 6 1 1 1 1 1 1 1 1 1 1 1 1 1 1
symmnumber: 1
zpe: 569989.9 jmol-1
zpe.correction: 0.217098 hartree
zpe.thermalcorrener: 0.231508 hartree
zpe.thermalcorrenthalpy: 0.232452 hartree
zpe.thermalcorrgfe: 0.176570 hartree
zpe.sumelectzpe: -725.360450 hartree
zpe.sumelectthermal: -725.346040 hartree
zpe.sumelectthermalent: -725.345095 hartree
zpe.sumelectthermalfe: -725.400977 hartree
dipole: 3.4524 1.1795 1.4522
dipole: 3.9267
quadrupole: -88.3811 -78.3525 -75.3050
quadrupole: -5.3503 -4.7301 3.7698
quadrupole: -7.7016 2.3270 5.3745 -5.3503 -4.7301 3.7698
hfenergy: -725.5775474 hartree
pointgroup: C01 [X(C7H14O6)]
dipole: 1.4076145 0.3249476 0.547476 debye
polarizability: 109.6964524|-0.9726114|103.6050154|-1.7229865|1.5648766|73.8374699 unknown
InChI: InChI=1S/C7H14O6/c1-12-6-4(9)3(2-8)13-7(11)5(6)10/h3-11H,2H2,1H3
charge 0 multiplicity 1
27 atoms
O  -1.290141 1.099805 0.210267
O  2.070532 -1.436881 0.373767
O  -0.449971 -2.499336 -0.299355
O  2.384498 1.491764 -0.420247
O  -0.010188 3.075095 0.160518
O  -3.892616 0.100396 -0.273825
C  1.068193 -0.557279 -0.237585
C  -0.281487 -1.147426 0.227148
C  -1.460218 -0.300319 -0.279663
C  1.181729 0.91519 0.186139
C  -0.061206 1.708938 -0.300517
C  -2.823072 -0.749149 0.249655
C  3.390677 -1.417234 -0.282594
H  1.137871 -0.619748 -1.347588
H  -0.283826 -1.156072 1.339647
H  -1.474442 -0.294476 -1.390135
H  1.225086 0.976488 1.296721
H  -0.068738 1.775187 -1.406843
H  -2.80588 -0.739388 1.360908
H  -3.035539 -1.770415 -0.100097
H  0.390969 -2.984647 -0.085972
H  2.357364 2.472771 -0.26479
H  -0.228839 3.088959 1.129252
H  3.86068 -0.423772 -0.191793
H  3.297829 -1.680804 -1.356091
H  3.98877 -2.181768 0.237763
H  -3.637634 1.041522 -0.087491
