program: Gaussian 09
title: 000096203
version: EM64L-G09RevD.01
frameworkgroup: C1[X(C12H18O4)]
method: RPBEPBE
basis: SDD
operation: Freq
keyword: #pfreq=noraman
keyword: PBEPBE/SDD
title: #p freq=noraman PBEPBE/SDD
converged: YES YES NO NO
title: Mulliken charges:
elementType: O O O O C C C C C C C C C C C C H H H H H H H H H H H H H H H H H H
charge: -0.265961 -0.265293 -0.228991 -0.222115 -0.154371 -0.478150 -0.321770 -0.457632 -0.221350 -0.246508 0.246892 0.217365 -0.225597 -0.225056 -0.673356 -0.673187 0.262386 0.222953 0.226347 0.284985 0.217615 0.213684 0.267409 0.229444 0.228341 0.231752 0.227749 0.233416 0.232662 0.212513 0.229204 0.212445 0.229858 0.232316
chargesum: 0.00000
title: Mulliken charges with hydrogens summed into heavy atoms:
elementType: O O O O C C C C C C C C C C C C
charge: -0.265961 -0.265293 -0.228991 -0.222115 0.108015 -0.028849 -0.036785 -0.026333 0.046059 -0.017064 0.246892 0.217365 0.234497 0.236109 0.001023 0.001432
polarizability: 1.64660223e+02 3.03854431e+00 1.49376157e+02 4.27935226e+00 -8.16579130e-01 1.08320623e+02
1716.lowfreq: -3.6944 -0.0006 -0.0006 -0.0003 7.1234 9.3414 20.6649 25.5629 56.0717
frequency: 20.3729 25.5408 56.0623 60.0449 68.4577 70.4645 78.0708 93.5727 117.9535 147.7520 157.5967 196.5591 232.7604 252.1006 259.1844 261.4482 293.5779 319.2069 341.3872 373.4447 400.5012 489.9893 580.5936 603.7774 674.9215 715.1941 737.8268 766.8951 772.1525 799.3089 800.0581 807.7065 822.2608 834.8701 897.0105 911.5661 918.6238 954.1230 956.8191 991.5330 1019.3053 1022.6676 1025.0640 1072.8262 1082.8253 1106.1425 1112.4433 1115.3203 1118.7349 1129.3894 1135.2142 1136.0238 1164.8569 1195.8581 1232.8008 1249.0718 1250.2394 1259.7881 1281.6173 1291.8922 1298.5107 1316.5723 1346.7141 1355.8583 1356.9834 1400.0607 1400.6980 1463.0033 1463.5762 1464.9211 1473.7617 1474.2762 1480.8329 1486.1498 1486.4835 1627.8481 1632.7903 1644.1415 2970.5417 2983.8990 2995.9247 2996.3837 2999.2869 3011.2410 3011.4577 3027.0660 3039.9335 3069.7060 3070.6345 3070.7903 3092.4931 3092.8390 3108.0345 3109.0868 3143.2597 3182.4256
redmass: 3.9111 3.7722 2.7692 2.8319 3.4599 3.6220 3.2947 3.4459 2.5133 3.0496 2.8836 2.5894 2.2737 2.2120 1.6698 2.3241 3.7760 4.4410 4.2636 3.3100 3.9156 2.6814 4.4620 4.1169 3.9187 3.7842 1.6978 5.2196 5.1678 1.1095 1.1044 3.5335 3.9818 1.6585 2.2884 5.2903 2.6739 1.4615 2.9484 2.3024 1.9641 2.3616 2.5074 1.9114 1.9018 2.8566 2.2612 2.2278 1.4903 2.2295 1.4732 1.4699 1.8484 1.3030 1.6224 1.1419 1.1363 1.3799 1.4092 1.7032 1.2920 1.3349 1.6603 1.4017 1.3790 1.2634 1.2643 1.0402 1.0412 1.0865 1.0619 1.0628 1.0923 1.0678 1.0683 8.7372 6.8671 11.1716 1.0630 1.0832 1.0358 1.0359 1.0662 1.0582 1.0582 1.0946 1.0835 1.1065 1.1047 1.1044 1.0985 1.0985 1.1026 1.1027 1.0876 1.1049
irintensity: 0.7424 0.7833 0.0897 1.0256 1.2384 0.9583 0.4440 0.4316 1.6181 1.8836 0.7219 5.5522 5.2974 2.6840 2.3103 1.9114 3.0101 10.4704 6.3649 5.8486 2.1912 1.8048 16.2480 10.3038 8.0443 10.1923 44.3233 1.2817 0.8751 4.2683 4.8654 5.4570 8.2495 3.0430 2.7301 18.0922 15.1046 3.4827 10.9693 12.3226 25.8356 40.5544 96.5983 8.2794 27.4427 224.6214 38.7473 59.9637 62.5809 176.8858 12.1923 7.1685 87.5512 2.8685 106.1231 1.6538 1.0163 46.6543 56.2198 32.5078 4.9993 19.4593 14.5897 3.1274 1.6240 17.4340 26.9525 12.6354 9.3228 8.8116 5.6501 1.8887 9.1774 13.2441 14.6680 84.7058 26.2322 238.6561 53.6222 8.5593 19.9340 21.2787 20.3169 19.1405 17.2779 34.4431 1.9353 6.3898 7.3824 35.4286 30.6363 29.2301 41.6730 40.7804 9.9220 18.1155
temp: 298.150 k
press: 1.00000 atm
elementType: 8 8 8 8 6 6 6 6 6 6 6 6 6 6 6 6 1 1 1 1 1 1 1 1 1 1 1 1 1 1 1 1 1 1
symmnumber: 1
zpe: 735772.5 jmol-1
zpe.correction: 0.280241 hartree
zpe.thermalcorrener: 0.298201 hartree
zpe.thermalcorrenthalpy: 0.299146 hartree
zpe.thermalcorrgfe: 0.231465 hartree
zpe.sumelectzpe: -767.711226 hartree
zpe.sumelectthermal: -767.693265 hartree
zpe.sumelectthermalent: -767.692321 hartree
zpe.sumelectthermalfe: -767.760001 hartree
dipole: 0.8529 2.2639 -2.2725
dipole: 3.3192
quadrupole: -80.2829 -88.6279 -102.0554
quadrupole: -3.5597 -1.4913 3.1238
quadrupole: 10.0391 1.6942 -11.7333 -3.5597 -1.4913 3.1238
hfenergy: -767.9914666 hartree
pointgroup: C01 [X(C12H18O4)]
dipole: -0.4679665 0.5663467 -1.0795948 debye
polarizability: 151.0863625|7.2313547|161.1887708|4.4931658|-8.4887759|110.0818696 unknown
InChI: InChI=1S/C12H18O4/c1-3-15-11(13)10(12(14)16-4-2)9-7-5-6-8-9/h5,7,9-10H,3-4,6,8H2,1-2H3
charge 0 multiplicity 1
34 atoms
O  -1.532286 1.069184 -0.791665
O  2.021359 1.000397 -0.568717
O  -0.727265 1.249331 1.389248
O  2.431193 -0.736829 0.926605
C  -0.260838 -1.768249 0.627816
C  -1.76288 -2.129788 0.366078
C  0.187998 -0.480963 -0.129252
C  -1.819546 -3.687848 0.272328
C  0.476923 -3.028833 0.185454
C  -0.3724 -4.070492 -0.00668
C  -0.70173 0.701214 0.263908
C  1.652977 -0.126629 0.162728
C  -2.477856 2.199059 -0.518337
C  3.420545 1.493665 -0.363093
C  -3.273469 2.424935 -1.799219
C  3.581398 2.734079 -1.234788
H  -0.07599 -1.587169 1.706213
H  -2.428212 -1.727451 1.149603
H  -2.082374 -1.689878 -0.597587
H  0.083666 -0.633207 -1.218822
H  -2.161723 -4.143534 1.224256
H  -2.51635 -4.037024 -0.513136
H  1.56744 -3.06685 0.112729
H  -0.068295 -5.086824 -0.280047
H  -3.116367 1.916316 0.338138
H  -1.880733 3.081375 -0.225547
H  4.116326 0.68216 -0.643619
H  3.553889 1.707161 0.712648
H  -2.604187 2.682184 -2.637687
H  -3.986479 3.257076 -1.654765
H  -3.845239 1.522119 -2.074077
H  4.602706 3.140962 -1.120315
H  3.420857 2.49208 -2.299238
H  2.860746 3.516371 -0.94196
