program: Gaussian 09
title: 000096211
version: EM64L-G09RevD.01
frameworkgroup: C1[X(C14H14N4)]
method: RPBEPBE
basis: SDD
operation: Freq
keyword: #pfreq=noraman
keyword: PBEPBE/SDD
title: #p freq=noraman PBEPBE/SDD
converged: YES YES NO NO
title: Mulliken charges:
elementType: N N N N C C C C C C C C C C C C C C H H H H H H H H H H H H H H
charge: 0.036953 0.037032 -0.590864 -0.590714 0.311890 0.311841 -0.082788 -0.083301 -0.379702 -0.379838 -0.415352 -0.415549 -0.222769 -0.222616 -0.240919 -0.240908 -0.245444 -0.245347 0.244221 0.244341 0.274348 0.274335 0.225803 0.225796 0.225999 0.226039 0.228395 0.228369 0.310657 0.319772 0.319718 0.310604
chargesum: 0.00000
title: Mulliken charges with hydrogens summed into heavy atoms:
elementType: N N N N C C C C C C C C C C C C C C
charge: 0.036953 0.037032 0.039564 0.039608 0.311890 0.311841 -0.082788 -0.083301 -0.135481 -0.135497 -0.141004 -0.141214 0.003034 0.003181 -0.014921 -0.014869 -0.017049 -0.016978
polarizability: 2.01625154e+02 3.02678477e-02 2.06242931e+02 2.97121284e+01 3.60132359e-02 1.49507988e+02
1716.lowfreq: -0.0007 -0.0005 0.0001 8.3678 9.2585 13.9837 28.9811 49.2763 54.4407
frequency: 28.9578 49.2706 54.4307 57.4642 107.6670 119.5310 170.3736 199.1474 218.0783 262.4847 264.2499 302.2902 328.2907 382.2624 394.8410 397.2663 423.0407 432.4766 435.0916 462.9792 506.7473 514.5824 543.6169 561.8319 614.9005 615.0981 645.9073 679.9128 686.8178 703.1625 708.8955 709.7450 776.4318 779.7131 858.6950 862.5297 883.5121 932.4998 933.7244 983.3986 985.6114 988.4718 988.5930 997.0897 997.9501 1006.3556 1026.6213 1037.3094 1076.1806 1078.1166 1094.1805 1143.6385 1171.8358 1172.0047 1188.4238 1189.7012 1212.9151 1232.7855 1243.7267 1306.8947 1318.7295 1353.7103 1372.9048 1376.6665 1432.8655 1435.6394 1478.2043 1480.2201 1515.3971 1533.6535 1580.7569 1581.0571 1607.1127 1607.5607 1632.6520 1633.8032 3119.7076 3119.8437 3125.9670 3126.4808 3138.4186 3138.7293 3146.9463 3147.4940 3163.1120 3163.3069 3413.4375 3414.8102 3655.3770 3655.8749
redmass: 5.4105 4.1768 3.8059 4.9002 4.7899 4.7433 4.4116 4.8394 4.2221 4.1970 5.2091 4.0650 4.4606 3.8954 2.1076 2.2669 1.8668 1.8962 1.3597 4.3696 2.8364 4.0365 1.3946 1.9937 6.1070 5.6876 3.2385 5.1560 5.0522 5.0512 1.5945 1.7628 2.0144 2.2206 1.2460 1.2639 4.7862 1.4617 1.3991 1.3791 1.5027 4.4684 6.1319 1.3033 1.3306 4.8508 2.3018 2.0626 2.0277 1.6349 3.1086 3.0740 1.0533 1.0544 1.1197 1.1182 1.7148 1.8975 3.0284 1.6115 1.3735 2.8041 6.4591 8.6475 2.3081 2.3641 2.2422 2.3491 8.5060 8.4299 5.8716 5.8728 5.9287 5.8801 1.1059 1.1035 1.0849 1.0850 1.0870 1.0872 1.0922 1.0923 1.0963 1.0963 1.1015 1.1015 1.0494 1.0496 1.0958 1.0958
irintensity: 0.2340 1.0467 0.5293 0.0563 2.1692 0.2139 5.5721 0.6416 16.2908 2.8493 0.8897 0.8269 2.7178 1.8571 141.4051 1.3162 178.2790 247.5558 10.8138 16.7676 3.6240 0.8190 13.4905 4.4562 0.4940 1.2457 1.9242 15.0619 0.9689 21.7521 81.8620 14.2268 34.3733 65.1509 0.2032 3.6219 50.0246 1.7463 0.2712 0.0331 0.8930 0.4535 0.4010 0.7729 1.2145 69.0940 3.5836 9.4856 49.2769 1.9566 59.4049 58.9298 0.0144 0.1827 1.1363 0.0309 23.5902 13.4975 5.5587 2.2631 2.2708 0.9439 4.6833 0.3792 22.7741 1.0812 20.4991 3.4560 112.4117 105.8973 0.2020 7.8126 8.1221 5.3412 30.4370 17.4084 4.2447 2.9647 0.1464 1.7765 14.6725 10.6006 2.0680 64.3580 17.9178 31.2717 7.7117 6.6694 38.6653 64.2385
temp: 298.150 k
press: 1.00000 atm
elementType: 7 7 7 7 6 6 6 6 6 6 6 6 6 6 6 6 6 6 1 1 1 1 1 1 1 1 1 1 1 1 1 1
symmnumber: 1
zpe: 665128.3 jmol-1
zpe.correction: 0.253334 hartree
zpe.thermalcorrener: 0.269351 hartree
zpe.thermalcorrenthalpy: 0.270295 hartree
zpe.thermalcorrgfe: 0.209231 hartree
zpe.sumelectzpe: -759.556251 hartree
zpe.sumelectthermal: -759.540235 hartree
zpe.sumelectthermalent: -759.539290 hartree
zpe.sumelectthermalfe: -759.600355 hartree
dipole: -0.0005 -1.1643 0.0019
dipole: 1.1643
quadrupole: -85.0431 -99.6285 -99.8932
quadrupole: 0.0157 6.8459 0.0133
quadrupole: 9.8118 -4.7736 -5.0383 0.0157 6.8459 0.0133
hfenergy: -759.8095852 hartree
pointgroup: C01 [X(C14H14N4)]
dipole: -0.0060954 0.4578066 0.0140361 debye
polarizability: 173.6967665|0.7054535|206.2477062|-39.4674077|0.2341666|177.4316004 unknown
InChI: InChI=1S/C14H14N4/c15-17-13(11-7-3-1-4-8-11)14(18-16)12-9-5-2-6-10-12/h1-10H,15-16H2
charge 0 multiplicity 1
32 atoms
N  -0.791198 -2.471432 1.055724
N  0.862823 -2.381301 -1.198758
N  -1.936897 -2.653871 1.787231
N  2.011919 -2.486767 -1.940359
C  -1.481704 -0.129806 0.443755
C  1.486843 -0.061359 -0.449423
C  -0.58204 -1.328165 0.39961
C  0.621681 -1.285475 -0.476371
C  -1.821762 0.55003 -0.758281
C  1.811871 0.553519 0.791079
C  -1.999996 0.374134 1.67172
C  1.987672 0.529506 -1.645456
C  -2.659491 1.685517 -0.738222
C  2.618101 1.710798 0.83838
C  -2.834883 1.512302 1.692481
C  2.791345 1.689228 -1.598642
C  -3.17273 2.171418 0.487244
C  3.114589 2.28329 -0.35622
H  -1.426507 0.175229 -1.709331
H  1.43041 0.110941 1.71832
H  -1.717003 -0.107217 2.61522
H  1.714982 0.098555 -2.615998
H  -2.9105 2.192916 -1.676674
H  2.858096 2.16752 1.805309
H  -3.213427 1.890877 2.649016
H  3.156883 2.134963 -2.530972
H  -3.820895 3.054749 0.503715
H  3.738635 3.183272 -0.320123
H  -2.741873 -2.01855 1.733767
H  -2.06696 -3.60069 2.130894
H  2.169302 -3.407836 -2.33836
H  2.798115 -1.832296 -1.849474
