program: Gaussian 09
title: 000096159
version: EM64L-G09RevD.01
frameworkgroup: C1[X(C10H8O2)]
method: RPBEPBE
basis: SDD
operation: Freq
keyword: #pfreq=noraman
keyword: PBEPBE/SDD
title: #p freq=noraman PBEPBE/SDD
converged: YES YES NO NO
title: Mulliken charges:
elementType: O O C C C C C C C C C C H H H H H H H H
charge: -0.170598 -0.170600 -0.313443 0.225828 0.225829 -0.004080 -0.004080 -0.683447 -0.359278 -0.359277 -0.207272 -0.207273 0.275388 0.221369 0.244918 0.244918 0.279370 0.279370 0.241179 0.241179
chargesum: 0.00000
title: Mulliken charges with hydrogens summed into heavy atoms:
elementType: O O C C C C C C C C C C
charge: -0.170598 -0.170600 -0.038055 0.225828 0.225829 -0.004080 -0.004080 0.027758 -0.079908 -0.079907 0.033907 0.033906
polarizability: 1.49993320e+02 -1.89210657e-05 1.24098495e+02 4.73324464e+00 -5.38794585e-05 5.34134885e+01
1716.lowfreq: -7.5555 -1.3383 -0.0001 0.0006 0.0008 7.6646 47.8417 120.6214 157.9114
frequency: 47.8242 120.6205 157.9111 187.3908 208.2235 235.0963 270.2411 326.1134 420.0031 437.9650 501.6009 523.2466 544.2835 604.4300 672.5194 679.9369 739.0771 768.8629 799.4765 801.9702 910.3601 926.9380 934.7551 983.8231 1011.0307 1013.5000 1044.9252 1075.9763 1092.1389 1126.5626 1173.1654 1183.4725 1218.7999 1235.4619 1265.1642 1280.8351 1383.9019 1407.3533 1451.5641 1452.0767 1472.0871 1478.7718 1590.4226 1596.9965 1631.3647 1655.1601 2979.8776 2998.5237 3099.3039 3110.1539 3137.2517 3150.9067 3162.5604 3172.1876
redmass: 4.0935 4.8923 6.2222 1.1147 2.3946 6.6089 4.2697 10.0121 3.1520 4.4719 5.3424 7.4121 9.7707 3.6332 4.7518 5.3948 2.0541 4.2022 3.6831 1.6590 1.3984 2.7856 3.7116 1.3971 2.0768 1.3589 1.9454 2.2164 1.6386 2.8428 1.1300 1.9975 1.6721 1.6240 3.7173 1.6367 1.2028 7.2342 2.5132 2.5632 1.0488 1.0525 7.4364 7.6445 10.2913 12.3097 1.0807 1.0344 1.1007 1.1015 1.0864 1.0901 1.0956 1.1004
irintensity: 7.8079 0.0113 1.1469 0.5369 0.8816 0.2457 6.5566 9.0937 6.4079 0.0758 9.9384 0.7372 9.9907 0.3533 0.1248 5.6417 48.3497 0.0327 0.7109 41.0920 0.1405 38.2617 6.9510 2.8680 0.1766 0.0055 0.0997 2.5643 0.4080 0.3054 13.4238 2.6672 1.3049 40.3892 208.3671 4.7568 21.0478 12.0167 0.3245 0.1266 20.4276 3.6480 165.4934 0.6462 178.3809 82.4499 3.1697 25.6854 23.2266 8.6200 1.6760 4.0352 5.4761 22.8884
temp: 298.150 k
press: 1.00000 atm
elementType: 8 8 6 6 6 6 6 6 6 6 6 6 1 1 1 1 1 1 1 1
symmnumber: 1
zpe: 397484.2 jmol-1
zpe.correction: 0.151394 hartree
zpe.thermalcorrener: 0.161314 hartree
zpe.thermalcorrenthalpy: 0.162258 hartree
zpe.thermalcorrgfe: 0.115698 hartree
zpe.sumelectzpe: -535.478391 hartree
zpe.sumelectthermal: -535.468471 hartree
zpe.sumelectthermalent: -535.467527 hartree
zpe.sumelectthermalfe: -535.514087 hartree
dipole: 3.2626 0.0000 0.1460
dipole: 3.2659
quadrupole: -57.3066 -81.3346 -69.2421
quadrupole: 0.0000 0.8494 0.0001
quadrupole: 11.9878 -12.0402 0.0523 0.0000 0.8494 0.0001
hfenergy: -535.629785 hartree
pointgroup: C01 [X(C10H8O2)]
dipole: 1.2846912 -0.0000507 0.0234849 debye
dipolederiv: -0.6148085 0.1865352 -0.0108018 0.2926809 -0.9351382 0.0270537 -0.0107437 -0.0116553 -0.3150432 -0.6148489 -0.1865628 -0.0107998 -0.2927071 -0.9350973 -0.0270395 -0.0107281 0.0116877 -0.3150427 -0.4971023 0.0000048 0.0174493 0.0000049 -0.3553349 0.0000076 -0.0000061 0.0000046 0.0846855 -0.5582497 0.2408442 -0.0180596 0.2956654 -0.1310242 0.0224634 -0.051582 0.004196 0.0190291 -0.5582925 -0.2408078 -0.0180516 -0.2956323 -0.1309812 -0.0224562 -0.0515689 -0.0041905 0.0190297 1.2522927 -0.3028374 0.0651614 -0.180356 1.0701891 -0.0158819 0.1232844 0.0324939 0.121019 1.2523311 0.3028254 0.0651542 0.1803454 1.0701452 0.0158499 0.1232708 -0.0325379 0.121019 0.1484877 -0.0000052 0.0242617 -0.0000055 0.0184731 0.0000002 -0.0881574 0.0000034 0.0993056 -0.1215232 -0.0941292 0.0026044 0.1092101 0.1285923 0.0027076 -0.0026704 -0.009571 -0.104509 -0.1215255 0.0941496 0.002602 -0.1091885 0.1285938 -0.002714 -0.0026677 0.0095651 -0.1045089 0.1177363 0.1169963 0.0191327 0.1251074 -0.0487782 0.0055113 0.0168874 0.0088317 -0.1317973 0.1177172 -0.1170086 0.0191356 -0.1251203 -0.048757 -0.0055161 0.016891 -0.0088357 -0.1317967 0.0938489 -0.0000012 -0.0453178 -0.0000019 0.0743706 0.0000009 -0.0273166 -0.0000001 -0.0380764 0.0368001 0.000002 -0.0982448 0.000002 0.0919902 0.0000031 -0.0165963 -0.000001 -0.1140167 0.0017482 0.0747335 0.0099764 0.1420091 -0.0235539 0.0158945 0.0090255 0.0309606 0.0793795 0.0017277 -0.0747366 0.0099761 -0.1420114 -0.0235338 -0.0158945 0.0090249 -0.0309598 0.07938 0.1004844 0.0167698 -0.0043548 -0.0295401 -0.0259813 -0.0010186 -0.0044881 0.0010819 0.1603705 0.1004861 -0.0167814 -0.0043546 0.0295293 -0.0259821 0.001024 -0.0044918 -0.001078 0.1603703 -0.0686614 -0.0761124 -0.0127336 -0.081345 0.0509101 -0.0053217 -0.0136841 -0.0032579 0.1556014 -0.0686485 0.0761219 -0.0127354 0.0813537 0.0508979 0.0053262 -0.0136831 0.0032625 0.1556013 unknown
polarizability: 150.1759336|-0.0010515|124.0984946|2.1756512|-0.0013315|53.2308749 unknown
InChI: InChI=1S/C10H8O2/c1-6-9(11)7-4-2-3-5-8(7)10(6)12/h2-6H,1H3
charge 0 multiplicity 1
20 atoms
O  -1.33904 2.425196 -0.097729
O  -1.339242 -2.425006 -0.097641
C  -1.920183 0.000117 -0.248505
C  0.422713 0.71011 -0.043557
C  0.422655 -0.710064 -0.043536
C  -0.98115 1.219288 -0.128028
C  -0.98125 -1.219129 -0.128005
C  -3.08482 0.000176 0.770227
C  1.628237 1.438806 0.036092
C  1.628117 -1.438859 0.036138
C  2.837924 0.711849 0.113039
C  2.837865 -0.712002 0.113066
H  -2.355734 0.000124 -1.269992
H  -2.707255 0.000166 1.807833
H  -3.706294 0.900025 0.627376
H  -3.706379 -0.899616 0.627387
H  1.613819 2.533277 0.037633
H  1.613604 -2.533329 0.037707
H  3.792157 1.246348 0.174927
H  3.792055 -1.246577 0.17497
