program: Gaussian 09
title: 000096168
version: EM64L-G09RevD.01
frameworkgroup: C1[X(C12H16O3)]
method: RPBEPBE
basis: SDD
operation: Freq
keyword: #pfreq=noraman
keyword: PBEPBE/SDD
title: #p freq=noraman PBEPBE/SDD
converged: YES YES NO NO
title: Mulliken charges:
elementType: O O O C C C C C C C C C C C C H H H H H H H H H H H H H H H H
charge: -0.291929 -0.258189 -0.262038 -0.370687 -0.344701 -0.252789 -0.687868 0.218574 0.180078 -0.326252 -0.341567 0.331576 -0.347447 -0.338635 -0.537565 0.206364 0.206130 0.197133 0.197454 0.222611 0.222829 0.211378 0.211349 0.218548 0.271546 0.267953 0.255621 0.242550 0.224765 0.248469 0.224738
chargesum: 0.00000
title: Mulliken charges with hydrogens summed into heavy atoms:
elementType: O O O C C C C C C C C C C C C
charge: -0.291929 -0.258189 -0.262038 0.041806 0.049887 0.192652 -0.046593 0.218574 0.180078 -0.054706 -0.073614 0.331576 -0.091826 -0.096085 0.160408
polarizability: 2.22348980e+02 1.50092369e+01 1.44008913e+02 -1.81910047e-01 1.95964191e-01 7.98156264e+01
1716.lowfreq: -0.0004 0.0004 0.0009 4.5394 5.6643 10.7168 31.1541 49.2555 51.6298
frequency: 29.9250 49.0216 51.5626 68.5682 76.9038 112.2813 127.3053 142.0252 169.8244 225.4393 226.5465 228.2189 236.7586 271.9466 313.3131 365.5649 415.1592 417.4733 463.6628 506.6411 510.1214 594.8153 629.6047 677.6144 739.5825 750.5007 755.9098 797.0624 807.1128 822.3627 854.2863 899.3867 919.4177 932.2738 969.3051 982.9231 990.8800 999.5163 1040.0340 1059.0535 1084.6367 1111.6291 1112.9017 1124.6107 1148.0712 1155.2637 1173.2677 1212.7592 1234.0176 1248.3760 1270.4955 1274.6457 1286.4002 1297.7359 1346.2689 1375.6841 1380.8862 1394.8757 1427.7912 1436.4567 1468.7774 1468.9560 1470.9948 1472.2937 1479.5855 1480.8469 1490.1838 1497.6782 1572.4234 1615.3286 1620.8002 2965.7796 2971.1587 2976.6159 2990.0911 3000.1188 3014.3355 3043.0381 3056.4019 3069.2384 3076.9174 3078.0106 3129.5460 3153.7371 3155.6302 3173.9479 3178.5644
redmass: 3.9418 1.7295 3.9692 5.7947 3.2344 2.1393 3.6407 3.9543 3.1259 4.4104 1.1941 3.8297 1.1439 5.1828 4.7817 5.2770 3.1148 2.9727 4.6976 2.9427 5.3471 5.8742 7.0490 4.1264 1.0721 6.5011 4.4887 1.1423 7.4780 1.3135 1.6263 2.6357 3.2679 1.1637 1.3663 8.2702 1.3451 3.0868 3.2454 4.5587 2.1898 1.2598 1.3595 2.6050 1.4903 1.3186 1.2224 1.3435 3.0667 3.3786 1.1547 1.3945 1.0828 1.2799 1.4590 1.5794 5.5725 1.2209 4.2758 1.1748 1.0802 1.0496 1.0743 1.0676 1.0417 1.0650 1.0949 2.5058 8.1501 10.1985 6.6271 1.0327 1.0585 1.0370 1.0598 1.0566 1.1003 1.1037 1.1043 1.1047 1.0996 1.1039 1.0998 1.0884 1.0879 1.0966 1.0968
irintensity: 0.2500 0.7965 0.7337 0.1623 0.6252 0.0309 2.2708 0.0219 10.3509 2.5104 0.7878 2.6815 0.3530 12.9497 0.0456 0.0946 14.1758 0.0665 1.5274 8.6969 1.7124 24.6916 1.8887 26.5010 9.6159 9.7800 14.9016 1.3540 4.1750 10.3033 56.2257 22.3979 1.3096 0.4813 0.7327 73.5829 0.1533 35.6124 0.3886 401.4939 0.9528 0.2115 8.2483 1.7600 2.2098 9.4659 189.9416 0.0050 73.2533 472.2304 0.2916 55.1106 0.0840 0.2747 4.7567 4.8083 3.1648 8.8607 23.0781 7.7367 0.3984 14.2984 43.4280 0.0977 13.0648 4.9788 24.3557 66.9991 59.7627 128.5464 267.5884 64.6683 26.8825 31.5839 14.7823 48.7837 5.8238 2.0389 44.3786 0.0538 54.7456 128.5865 23.5139 0.5846 7.0613 8.1657 4.7285
temp: 298.150 k
press: 1.00000 atm
elementType: 8 8 8 6 6 6 6 6 6 6 6 6 6 6 6 1 1 1 1 1 1 1 1 1 1 1 1 1 1 1 1
symmnumber: 1
zpe: 669894.9 jmol-1
zpe.correction: 0.255149 hartree
zpe.thermalcorrener: 0.271033 hartree
zpe.thermalcorrenthalpy: 0.271978 hartree
zpe.thermalcorrgfe: 0.210210 hartree
zpe.sumelectzpe: -691.405695 hartree
zpe.sumelectthermal: -691.389811 hartree
zpe.sumelectthermalent: -691.388867 hartree
zpe.sumelectthermalfe: -691.450635 hartree
dipole: -0.5389 -4.0275 -0.0041
dipole: 4.0634
quadrupole: -70.9701 -88.8022 -91.2895
quadrupole: 7.4646 0.0073 0.0605
quadrupole: 12.7172 -5.1150 -7.6022 7.4646 0.0073 0.0605
hfenergy: -691.6608446 hartree
pointgroup: C01 [X(C12H16O3)]
dipole: -0.2017402 1.5831662 0.0930206 debye
polarizability: 222.1329741|-15.3922064|143.9598077|-2.5256443|3.9912907|80.0807379 unknown
InChI: InChI=1S/C12H16O3/c1-3-4-9-15-12(13)10-5-7-11(14-2)8-6-10/h5-8H,3-4,9H2,1-2H3
charge 0 multiplicity 1
31 atoms
O  1.63752 -0.107738 -0.044425
O  -4.751114 0.588706 0.064728
O  1.012248 -2.351598 -0.166114
C  3.919333 0.723845 -0.030021
C  5.431421 0.397131 -0.074343
C  3.063304 -0.541362 -0.088122
C  6.307983 1.666787 -0.023849
C  -0.704646 -0.622167 -0.046411
C  0.687303 -1.138007 -0.09216
C  -1.77382 -1.560173 -0.094351
C  -1.00114 0.760873 0.041637
C  -3.392157 0.262624 0.032465
C  -3.105653 -1.126123 -0.055697
C  -2.336326 1.210511 0.081583
C  -5.114348 2.007244 0.154579
H  3.68404 1.281926 0.896854
H  3.654002 1.382416 -0.879581
H  5.659017 -0.173153 -0.997745
H  5.69144 -0.266701 0.774924
H  3.227797 -1.115565 -1.019149
H  3.253187 -1.216174 0.767433
H  6.089852 2.332636 -0.879693
H  6.122153 2.240121 0.903696
H  7.383532 1.414861 -0.056253
H  -1.531682 -2.625632 -0.162709
H  -0.177107 1.478855 0.078633
H  -3.940778 -1.831645 -0.091995
H  -2.541716 2.282616 0.150232
H  -4.727517 2.461228 1.087021
H  -6.213776 2.020313 0.163157
H  -4.740153 2.572743 -0.720224
