program: Gaussian 09
title: 000096158
version: EM64L-G09RevD.01
frameworkgroup: C1[X(C16H13NOS)]
method: RPBEPBE
basis: SDD
operation: Freq
keyword: #p
keyword: freq=noraman
keyword: PBEPBE/SDD
title: #p freq=noraman PBEPBE/SDD
converged: YES YES NO NO
title: Mulliken charges:
elementType: S O N C C C C C C C C C C C C C C C C H H H H H H H H H H H H H
charge: 0.196027 -0.266418 0.051298 0.452012 -0.098517 -0.534107 -0.298805 -0.330753 0.320661 -0.350795 -0.158175 -0.338099 -0.120473 -0.196946 -0.264016 -0.228614 -0.209629 -0.231559 -0.536760 0.257216 0.247140 0.261430 0.244590 0.245953 0.258778 0.252172 0.227717 0.228645 0.228500 0.247110 0.222425 0.221993
chargesum: 0.00000
title: Mulliken charges with hydrogens summed into heavy atoms:
elementType: S O N C C C C C C C C C C C C C C C C
charge: 0.196027 -0.266418 0.051298 0.452012 -0.098517 -0.276891 -0.051666 -0.069322 0.320661 -0.350795 0.086415 -0.092146 -0.120473 0.061832 -0.011844 -0.000897 0.019016 -0.003059 0.154768
polarizability: 3.21358642e+02 7.36806655e+00 2.19593872e+02 1.31172327e+01 5.44950872e+00 1.08396947e+02
1716.lowfreq: -6.5329 -2.8951 -0.0013 -0.0009 -0.0007 12.8405 19.2415 26.8622 46.3429
frequency: 19.2255 26.7443 46.3315 56.1207 92.4792 137.8982 174.4016 184.7410 193.4894 242.6547 245.3432 251.8868 328.8818 354.6194 364.5916 403.2290 409.5570 430.8909 446.8206 478.0371 505.0963 519.8505 550.2605 565.9036 610.7339 632.0275 672.9832 679.0759 691.4363 711.5228 749.2142 771.7641 778.9999 812.1099 828.5498 842.5328 885.3901 888.7629 916.5676 927.0905 961.6639 970.8407 973.8567 985.4190 992.4633 1000.2640 1015.3982 1068.2357 1074.5215 1085.9498 1110.8820 1129.7142 1137.8705 1160.1947 1171.2164 1173.2630 1183.7300 1246.9121 1260.1848 1286.1388 1303.9231 1358.6247 1376.7843 1395.0778 1408.6176 1426.8462 1435.5135 1456.1056 1461.0762 1468.5269 1474.4368 1499.0609 1543.2640 1584.6351 1588.7585 1591.7974 1633.1247 2961.4788 3050.4827 3125.8471 3126.8087 3134.1058 3138.3855 3149.7721 3151.7266 3151.9085 3161.2518 3164.1933 3172.6495 3176.4055
redmass: 4.0967 5.0835 4.9150 4.5113 4.4710 5.1892 3.6166 3.6909 4.8388 3.9201 1.5608 3.6171 7.3991 5.0274 5.3325 2.8272 3.7925 7.1534 5.3581 3.2492 4.5114 6.8990 4.9969 3.2583 6.4668 7.7209 3.9305 6.3496 2.2023 6.5318 1.5851 5.2772 2.5500 1.3718 1.8481 1.2487 6.5389 1.6875 1.3799 4.3561 1.3432 1.3905 1.3547 5.8514 1.3417 4.0900 3.4103 2.5448 1.6023 2.7384 1.2570 1.9967 1.4358 1.2154 1.0524 1.6060 1.1147 1.9404 2.5767 2.5140 1.3141 3.3808 10.0790 2.9040 6.6713 2.1071 1.3044 2.4593 2.1755 1.0505 1.0933 4.0182 7.0044 6.4450 6.3437 6.3083 7.0226 1.0329 1.1041 1.0994 1.0848 1.0884 1.0891 1.0919 1.0876 1.0937 1.0981 1.0983 1.0969 1.0982
irintensity: 0.3195 0.4744 0.4802 1.3740 7.0781 1.5521 2.8138 2.9900 1.5030 5.8071 2.2983 0.7101 0.4150 0.2173 2.0208 0.3317 0.9326 0.2899 6.9581 9.1062 11.6847 3.2858 37.4650 0.4563 0.2963 4.7240 4.5110 10.5421 47.8861 1.4918 58.4543 6.9218 0.0752 19.5074 44.5858 1.2872 35.2215 47.0672 2.6015 3.5693 0.5332 0.6945 2.4519 7.5860 0.3465 60.8028 28.9248 86.9177 6.5571 66.6595 0.1714 22.4304 25.1707 21.5262 0.0239 92.3884 2.1672 25.1040 220.1579 2.4213 1.8389 57.3953 0.8279 7.5740 6.1798 10.4294 0.4502 30.3466 15.8543 13.6178 72.1465 78.9128 141.5364 117.3142 2.5982 24.1080 43.7599 82.4119 47.8076 27.3263 0.2201 5.6658 10.0877 10.1330 3.2385 25.1336 13.9973 28.5086 10.1239 5.8237
temp: 298.150 k
press: 1.00000 atm
elementType: 16 8 7 6 6 6 6 6 6 6 6 6 6 6 6 6 6 6 6 1 1 1 1 1 1 1 1 1 1 1 1 1
symmnumber: 1
zpe: 640526.8 jmol-1
zpe.correction: 0.243964 hartree
zpe.thermalcorrener: 0.260268 hartree
zpe.thermalcorrenthalpy: 0.261213 hartree
zpe.thermalcorrgfe: 0.197823 hartree
zpe.sumelectzpe: -1144.207635 hartree
zpe.sumelectthermal: -1144.191330 hartree
zpe.sumelectthermalent: -1144.190386 hartree
zpe.sumelectthermalfe: -1144.253775 hartree
dipole: -2.3651 -2.1335 0.1756
dipole: 3.1900
quadrupole: -102.7556 -100.3235 -118.7849
quadrupole: 3.0753 3.7163 1.9831
quadrupole: 4.5324 6.9645 -11.4969 3.0753 3.7163 1.9831
hfenergy: -1144.4515987 hartree
pointgroup: C01 [X(C16H13N1O1S1)]
dipole: 0.921028 -0.8523498 -0.0194629 debye
polarizability: 321.0987106|-7.7464109|218.8187858|14.1245818|-11.7136456|109.4319643 unknown
InChI: InChI=1S/C16H13NOS/c1-18-13-8-9-15-12(11-13)7-10-16(17-15)19-14-5-3-2-4-6-14/h2-11H,1H3
charge 0 multiplicity 1
32 atoms
S  -2.55951 1.937161 0.152633
O  5.280684 -0.526464 0.016797
N  -0.292241 0.328731 0.158313
C  2.025235 1.223701 0.030865
C  1.082907 0.125151 0.120539
C  3.421565 0.954276 -0.001438
C  1.476947 2.554096 -0.01946
C  1.585778 -1.208521 0.171808
C  3.886555 -0.368515 0.052917
C  -0.746945 1.57759 0.103996
C  0.099579 2.739974 0.016385
C  2.961401 -1.459546 0.139173
C  -3.347957 0.271807 0.134184
C  -3.119792 -0.660053 1.172197
C  -4.256729 -0.017774 -0.908776
C  -3.80688 -1.894558 1.158514
C  -4.95118 -1.250393 -0.907519
C  -4.725921 -2.190737 0.123656
C  5.820632 -1.8875 0.071241
H  4.149242 1.769902 -0.068673
H  2.151074 3.415392 -0.088242
H  0.860702 -2.025554 0.234371
H  -0.343888 3.739501 -0.024717
H  3.320967 -2.491997 0.178752
H  -2.410811 -0.425882 1.970717
H  -4.414088 0.708565 -1.712719
H  -3.628476 -2.620184 1.95987
H  -5.658551 -1.473681 -1.713778
H  -5.261472 -3.146751 0.122011
H  6.912467 -1.761471 0.031644
H  5.485169 -2.491382 -0.794143
H  5.539638 -2.397183 1.013284
