program: Gaussian 09
title: 000096131
version: EM64L-G09RevD.01
frameworkgroup: C1[X(C8H8Cl2N2O2)]
method: RPBEPBE
basis: SDD
operation: Freq
keyword: #p
keyword: freq=noraman
keyword: PBEPBE/SDD
title: #p freq=noraman PBEPBE/SDD
converged: NO YES NO NO
title: Mulliken charges:
elementType: Cl Cl O O N N C C C C C C C C H H H H H H H H
charge: -0.019041 -0.018776 -0.213694 -0.213723 -0.186202 0.015760 0.692374 -0.248651 -0.248552 0.439599 -0.412273 -0.411948 -0.625685 -0.625617 0.312934 0.312906 0.242371 0.251008 0.232016 0.250884 0.231876 0.242435
chargesum: 0.00000
title: Mulliken charges with hydrogens summed into heavy atoms:
elementType: Cl Cl O O N N C C C C C C C C
charge: -0.019041 -0.018776 -0.213694 -0.213723 -0.186202 0.015760 0.692374 -0.248651 -0.248552 0.439599 -0.099339 -0.099042 0.099710 0.099578
polarizability: 2.38858700e+02 3.15577690e-03 1.52836954e+02 1.61076130e-02 5.37009359e-01 6.05186460e+01
1716.lowfreq: -6.9745 -5.3649 -3.5679 0.0008 0.0025 0.0027 48.8656 60.0171 102.7659
frequency: 48.8549 60.0051 102.7656 115.0191 150.4605 165.3294 202.3361 212.3277 213.1027 217.7004 226.3845 284.3396 299.5946 336.7911 348.5280 389.8231 414.2012 497.7067 508.4315 539.1183 589.9457 613.3959 691.1552 715.9355 717.5460 758.8558 853.3772 911.1291 920.4006 947.6459 1041.3758 1059.3118 1091.5797 1115.0138 1126.5846 1156.8941 1173.4627 1210.5101 1221.6738 1335.1416 1353.3745 1366.3595 1414.7523 1431.4796 1432.3117 1458.8814 1467.6635 1472.2499 1474.0224 1524.9094 1550.8823 1592.7363 2960.1010 2964.6427 3034.0108 3037.6724 3120.3919 3122.7702 3187.8329 3189.0205
redmass: 5.8645 15.0728 3.3554 7.7325 5.6109 2.3549 1.9875 5.4844 3.8189 1.7995 2.1648 4.4447 2.8351 23.5739 11.8253 7.1855 3.0426 5.1428 8.3395 4.2354 5.3042 6.0570 7.8347 7.7234 8.2449 9.3059 10.5766 1.3458 1.4585 3.5890 2.5144 1.4412 1.2249 2.7840 1.3892 1.9220 2.0904 10.7255 2.7686 4.3984 2.6914 13.4986 6.4236 1.4770 1.1506 1.0825 1.0436 1.2242 1.0466 2.0665 10.0474 6.8054 1.0370 1.0373 1.1008 1.1013 1.0971 1.0977 1.0926 1.0935
irintensity: 0.1738 0.0611 6.6112 0.7401 1.4469 6.3143 0.4918 0.1218 3.3736 0.3470 1.2778 0.0406 3.2674 0.2030 1.3894 6.3230 0.0908 18.6938 5.4388 2.3606 2.9299 6.0551 12.1119 37.9754 15.4417 56.6962 0.5323 4.5277 40.5952 69.3823 7.5737 7.2774 26.4613 14.7368 1.3016 10.5821 33.3282 806.4233 21.0398 2.7096 21.8528 135.1180 60.3028 53.9698 8.5012 3.6703 35.0229 3.3980 13.1865 58.6840 11.0562 169.7579 29.7995 157.4161 55.5697 1.2079 9.1766 14.4655 8.1374 9.4309
temp: 298.150 k
press: 1.00000 atm
elementType: 17 17 8 8 7 7 6 6 6 6 6 6 6 6 1 1 1 1 1 1 1 1
symmnumber: 1
zpe: 399192.8 jmol-1
zpe.correction: 0.152044 hartree
zpe.thermalcorrener: 0.166005 hartree
zpe.thermalcorrenthalpy: 0.166949 hartree
zpe.thermalcorrgfe: 0.110648 hartree
zpe.sumelectzpe: -1488.582535 hartree
zpe.sumelectthermal: -1488.568575 hartree
zpe.sumelectthermalent: -1488.567630 hartree
zpe.sumelectthermalfe: -1488.623932 hartree
dipole: 7.0597 -0.0013 0.0045
dipole: 7.0597
quadrupole: -107.0609 -98.4624 -93.6487
quadrupole: 0.0023 0.0239 -1.7637
quadrupole: -7.3369 1.2616 6.0753 0.0023 0.0239 -1.7637
hfenergy: -1488.7345798 hartree
pointgroup: C01 [X(C8H8Cl2N2O2)]
dipole: 2.7775012 0.0039229 0.0035901 debye
dipolederiv: -0.1987851 -0.2404717 0.0470778 -0.2231744 -0.588087 0.1079232 0.0387987 0.0868978 -0.0655526 -0.1997824 0.2415402 -0.047 0.2242232 -0.5871948 0.1070871 -0.0390989 0.0857137 -0.0651782 -0.9203142 0.2000177 -0.0627534 0.5448069 -0.6266647 0.1262612 -0.180619 0.1223533 -0.2723403 -0.91847 -0.2009129 0.0619311 -0.5455459 -0.6287487 0.1258812 0.179417 0.122612 -0.2721076 -1.3131428 -0.0022832 -0.0013936 0.0020221 -0.3340132 -0.0089184 -0.0000624 0.059232 -0.3865638 2.5533992 0.0023769 0.0013937 0.0020707 0.9437736 -0.2552007 0.0014089 -0.2284447 0.2555307 1.4058338 0.0020911 0.0027646 0.0012094 -0.2195369 0.1569276 0.0031025 0.1132433 -0.0068901 -0.2578687 0.3788677 -0.0557679 0.6940447 0.8243476 -0.1831767 -0.4470913 -0.1727498 -0.0609497 -0.2548301 -0.3817286 0.0540089 -0.6965699 0.8220799 -0.1822723 0.4449707 -0.1698385 -0.0607513 -1.3427489 -0.002234 -0.0009994 -0.002602 0.0418409 0.0051894 0.0000646 -0.0053546 0.0376316 0.3917104 -0.0647233 0.0041444 0.1984677 -0.1807813 0.0220048 -0.0633231 0.0181114 -0.0627824 0.3904567 0.0668598 -0.0029212 -0.1963378 -0.181255 0.0214922 0.0639567 0.0180513 -0.0627197 0.3251796 -0.0883676 0.1785898 -0.5223006 0.2939251 -0.0262838 0.3818299 -0.0023425 0.241815 0.3248094 0.088693 -0.1773882 0.5196922 0.2966938 -0.0258728 -0.3827822 -0.0044936 0.2396684 0.1240804 0.0379852 -0.0093096 0.0006516 0.097729 0.0170528 0.0474811 0.0246754 0.1699709 0.1241294 -0.0381093 0.0091978 -0.000581 0.0975514 0.0170075 -0.0476745 0.024419 0.1699604 -0.0177758 0.0840978 -0.0209998 0.2116226 -0.0781771 -0.0070865 0.0103398 -0.0731653 0.0295386 0.0349578 -0.0172439 0.1194826 0.0233194 0.0821567 0.0616057 0.0421061 0.031431 -0.0065856 -0.1346871 -0.0594075 -0.1078972 -0.1205498 -0.0391711 -0.0674455 -0.1550209 -0.0048019 0.0776006 0.0359577 0.016028 -0.1200298 -0.0242091 0.0819944 0.0603352 -0.0412834 0.0310121 -0.0084316 -0.1368492 0.0597122 0.1067986 0.121521 -0.0376533 -0.0653322 0.1523271 -0.0033564 0.0796434 -0.0152604 -0.0827878 0.0210709 -0.2117809 -0.0808091 -0.0071791 -0.0088475 -0.0732047 0.0294933 unknown
polarizability: 238.8583668|0.152483|146.6417593|0.1557098|-23.1051521|66.7141746 unknown
InChI: InChI=1S/C8H8Cl2N2O2/c1-11(2)8-6(9)3-5(12(13)14)4-7(8)10/h3-4H,1-2H3
charge 0 multiplicity 1
22 atoms
Cl 1.243346 2.767656 -0.584171
Cl 1.250196 -2.770322 0.578618
O  -3.751422 1.081857 -0.350789
O  -3.748936 -1.096592 0.345826
N  2.59258 0.000713 0.001833
N  -3.143953 -0.006545 -0.002144
C  1.199069 -0.000826 0.000011
C  0.414934 1.163471 -0.320624
C  0.41743 -1.168174 0.318067
C  -1.673089 -0.004777 -0.001966
C  -0.982787 1.177882 -0.343794
C  -0.980062 -1.186114 0.33986
C  3.384637 -0.582864 1.100441
C  3.387198 0.588325 -1.092363
H  -1.543525 2.086992 -0.572733
H  -1.539085 -2.09664 0.567398
H  3.924849 -1.496756 0.788125
H  2.740347 -0.832789 1.956035
H  4.126377 0.168973 1.436458
H  2.746622 0.829333 -1.953369
H  4.138193 -0.157739 -1.420553
H  3.917083 1.508235 -0.779765
