program: Gaussian 09
title: 000096135
version: EM64L-G09RevD.01
frameworkgroup: C1[X(C9H8INO4)]
method: RPBEPBE
basis: SDD
operation: Freq
keyword: #p
keyword: freq=noraman
keyword: PBEPBE/SDD
title: #p freq=noraman PBEPBE/SDD
converged: YES YES NO NO
title: Mulliken charges:
elementType: I O O O O N C C C C C C C C C H H H H H H H H
charge: 0.042251 -0.374903 -0.462000 -0.249160 -0.212151 -0.426096 0.544169 0.196992 -0.544893 -0.329080 0.147157 -0.376994 0.270859 0.105634 -0.840443 0.284982 0.312237 0.225208 0.303877 0.318214 0.317729 0.360591 0.385820
chargesum: 0.00000
title: Mulliken charges with hydrogens summed into heavy atoms:
elementType: I O O O O N C C C C C C C C C
charge: 0.042251 -0.014312 -0.076180 -0.249160 -0.212151 -0.122219 0.544169 0.196992 -0.259911 -0.016843 0.147157 -0.151786 0.270859 0.105634 -0.204501
polarizability: 2.21439998e+02 2.93386905e+00 1.77952966e+02 -4.51870101e-01 2.13215932e-01 5.45508203e+01
1716.lowfreq: -4.7806 -4.6341 -1.6151 -0.0006 -0.0005 0.0007 21.7936 36.7063 53.5418
frequency: 21.7466 36.6973 53.5414 56.7085 69.7057 127.4505 128.8295 194.9006 197.6891 278.3515 297.2521 362.9823 370.2922 388.4328 406.0915 420.2283 424.0267 508.1647 534.0594 561.3277 592.1305 594.0734 614.2570 635.3907 694.2287 716.7143 733.8695 766.2001 791.8349 825.2315 834.8683 889.5297 929.0319 964.2918 976.2657 986.9369 1092.6038 1140.2293 1147.1593 1171.9531 1196.4669 1220.6624 1254.9748 1264.9687 1298.0793 1322.2847 1385.1726 1409.6276 1414.0340 1500.6061 1535.6696 1593.0516 1600.8925 1623.1593 1659.4681 3066.7067 3122.7469 3147.5024 3158.2958 3191.0154 3447.1053 3537.3248 3551.2053
redmass: 5.4762 11.7710 14.9305 7.2560 3.4075 4.8422 8.3583 4.9385 8.2229 11.5420 9.1350 7.0633 4.7394 9.2205 1.1619 7.4225 2.8314 4.3645 2.6609 1.9970 2.2122 2.9174 5.7175 5.5010 3.1067 1.3722 6.0161 4.1777 6.2296 1.5181 1.7247 6.3488 1.5877 7.1625 1.3239 3.7421 1.9323 1.1460 1.4309 1.1721 1.7877 1.7469 2.0290 1.9370 2.2048 2.1346 4.1334 1.3582 3.2056 3.2296 2.0434 8.4155 5.0870 6.6945 8.6906 1.0565 1.0907 1.1078 1.0921 1.0951 1.0771 1.0642 1.0659
irintensity: 0.3438 1.6012 0.0256 8.1770 5.3409 4.4163 5.4052 3.7161 6.0401 0.1427 4.2378 0.0786 0.4722 7.3788 132.9263 24.7936 0.1848 34.6386 1.4038 13.5617 145.6682 125.0579 28.2885 29.4382 0.1343 44.5885 0.5027 8.9466 20.2427 53.9998 27.1615 29.8546 32.3150 85.6676 1.9857 137.1924 156.0851 0.2316 198.3114 20.6359 6.5988 57.1935 24.9560 25.4527 99.4920 73.6222 23.3365 34.7581 1.2149 394.0374 306.5007 211.2773 60.1397 65.1934 293.5872 1.5294 15.9267 0.1403 5.5778 6.6484 110.3223 43.7486 50.4136
temp: 298.150 k
press: 1.00000 atm
elementType: 53 8 8 8 8 7 6 6 6 6 6 6 6 6 6 1 1 1 1 1 1 1 1
symmnumber: 1
zpe: 418910.1 jmol-1
zpe.correction: 0.159554 hartree
zpe.thermalcorrener: 0.174134 hartree
zpe.thermalcorrenthalpy: 0.175078 hartree
zpe.thermalcorrgfe: 0.114105 hartree
zpe.sumelectzpe: -713.841679 hartree
zpe.sumelectthermal: -713.827100 hartree
zpe.sumelectthermalent: -713.826156 hartree
zpe.sumelectthermalfe: -713.887129 hartree
dipole: -1.1531 0.5886 0.0661
dipole: 1.2964
quadrupole: -110.1542 -93.9809 -103.2056
quadrupole: 14.1087 -0.2942 -0.1451
quadrupole: -7.7073 8.4660 -0.7587 14.1087 -0.2942 -0.1451
hfenergy: -714.0012332 hartree
pointgroup: C01 [X(C9H8I1N1O4)]
dipole: -0.5054385 -0.0610415 0.0306613 debye
dipolederiv: -0.2199183 0.0555305 0.0157587 0.3364058 -0.5529065 -0.0366591 0.0212349 -0.0129138 -0.0691837 -1.2126026 0.7258276 0.0720149 0.5872905 -0.3527791 -0.0634414 0.073958 -0.0775575 -0.381151 -0.3303072 0.1818477 -0.016177 -0.0328887 -1.2909329 0.0283313 -0.0103849 0.0046507 -0.4361911 -0.9042377 0.3211206 0.059326 -0.5745844 -0.9328234 0.0699209 0.0653041 -0.0136771 -0.3526923 -1.1477383 -0.0217737 0.0888551 -0.1946144 -0.5452901 0.0276223 0.0931014 0.0090984 -0.3206541 -1.7438357 0.1822126 0.1583848 -0.052652 -0.3912779 0.0060245 0.1590692 -0.0157084 -0.2839733 0.9108507 -0.4090972 -0.08263 -0.5722656 -0.1817557 0.0681552 -0.0762723 0.0493205 0.078491 -0.5649442 -0.4301514 0.0714182 -0.0310287 -0.3781393 0.0135362 0.0600478 0.0553265 -0.0087066 0.1118033 0.3591161 -0.0360611 -0.0931587 0.0175269 0.005441 -0.0236409 -0.0417139 -0.1401657 -0.0541187 -0.1668817 -0.0013111 0.1208902 0.1216463 -0.0193833 -0.0099967 0.0119478 -0.1111159 1.1151051 -0.7069254 -0.0932467 -0.3114753 0.3594487 0.0259262 -0.1019454 0.0675308 0.0851421 -0.4621121 0.2918827 0.0229443 -0.1965212 0.1740377 0.0126191 0.0351955 -0.0398337 -0.1858724 1.9077636 -0.4870369 -0.1850696 1.0874155 0.6798529 -0.1334172 -0.1892274 0.0235484 0.2049125 1.5851943 0.2176734 -0.1484786 0.4663238 1.6952308 -0.0912221 -0.154391 -0.0627039 0.2500707 -0.2215019 0.2031794 0.0241571 -0.3301425 0.9087053 0.0455448 0.0106039 -0.006592 0.0083988 0.1332795 0.0688956 0.0016612 0.0841364 0.0212107 -0.0055649 0.0015424 -0.004194 0.1664173 0.15734 -0.0881809 0.0034972 -0.0582597 0.1354658 0.0078775 0.0030644 0.0105268 0.1742556 0.0336021 0.0809904 0.012211 0.0600824 -0.095996 -0.0000173 0.0125427 -0.0021419 0.165332 0.3266227 -0.1474052 -0.0074042 -0.1954677 0.2538011 0.024668 -0.0077114 0.0189579 0.2772395 0.0623758 0.0199245 0.038263 0.0079238 -0.0618285 0.058957 0.0790406 -0.0170734 0.0454719 0.0380551 0.023672 -0.0363707 0.0027262 -0.0583889 -0.0641996 -0.07524 0.0069607 0.0604799 0.3751784 -0.1920709 0.0050756 -0.122374 0.1250214 0.0196425 0.0036704 0.0267544 0.3792319 0.1041461 -0.0823498 0.0331821 0.0122384 0.3501709 -0.0003615 0.0304347 0.0094866 0.3942629 unknown
polarizability: 212.5676816|-16.3905906|185.0181789|-16.8234736|0.2392261|56.3579239 unknown
InChI: InChI=1S/C9H8INO4/c10-4-8(13)11-5-1-2-7(12)6(3-5)9(14)15/h1-3,11-12,14H,4H2
charge 0 multiplicity 1
23 atoms
I  -4.165438 2.853469 0.520447
O  3.363272 -1.689304 -0.244069
O  2.50579 2.522395 -0.262165
O  -3.247303 -1.476296 0.445674
O  4.198483 0.943418 -0.397081
N  -1.866696 0.421962 0.258553
C  -0.572341 -0.165603 0.135307
C  1.855694 0.21968 -0.131973
C  0.529197 0.704704 -0.003177
C  -0.354132 -1.570228 0.146557
C  2.067255 -1.19331 -0.119125
C  0.954838 -2.061939 0.019992
C  -3.075689 -0.216573 0.400374
C  2.977394 1.184348 -0.275511
C  -4.349229 0.630135 0.50623
H  0.386174 1.789763 -0.015315
H  -1.202009 -2.249281 0.25291
H  1.119019 -3.147273 0.029269
H  -1.900395 1.448209 0.24213
H  -4.868678 0.381808 1.443779
H  -5.004806 0.406094 -0.349046
H  3.358839 -2.680293 -0.21845
H  3.292762 3.121916 -0.36091
