program: Gaussian 09
title: 000096229
version: EM64L-G09RevD.01
frameworkgroup: C1[X(C23H24N4O2)]
method: RPBEPBE
basis: SDD
operation: Freq
keyword: #p
keyword: freq=noraman
keyword: PBEPBE/SDD
title: #p freq=noraman PBEPBE/SDD
converged: YES YES NO NO
title: Mulliken charges:
elementType: O O N N N N C C C C C C C C C C C C C C C C C C C C C C C H H H H H H H H H H H H H H H H H H H H H H H H
charge: -0.291899 -0.291859 -0.125794 -0.125800 -0.270013 -0.270024 -0.650399 0.097220 0.097214 0.273596 0.273616 0.089327 0.089238 -0.808149 -0.808207 0.438289 0.438284 -0.662974 -0.662962 -0.362327 -0.362322 -0.383001 -0.382979 -0.214736 -0.214737 -0.213455 -0.213447 -0.252782 -0.252785 0.239775 0.239792 0.239287 0.235072 0.315414 0.239265 0.235045 0.315524 0.249449 0.269031 0.239199 0.239190 0.249450 0.269017 0.280541 0.280534 0.261548 0.261541 0.226790 0.226786 0.226682 0.226678 0.229132 0.229127
chargesum: 0.00000
title: Mulliken charges with hydrogens summed into heavy atoms:
elementType: O O N N N N C C C C C C C C C C C C C C C C C C C C C C C
charge: -0.291899 -0.291859 -0.125794 -0.125800 -0.270013 -0.270024 -0.170833 0.097220 0.097214 0.273596 0.273616 0.089327 0.089238 -0.018375 -0.018374 0.438289 0.438284 0.094706 0.094695 -0.081786 -0.081788 -0.121453 -0.121438 0.012054 0.012048 0.013227 0.013231 -0.023650 -0.023658
polarizability: 4.26189413e+02 1.31804939e+01 2.97902009e+02 6.79169431e-03 1.44335346e-02 1.65535394e+02
1716.lowfreq: -9.4690 -3.1446 -0.0008 -0.0003 -0.0001 7.0404 14.4414 28.5931 32.7711
frequency: 14.0620 28.5855 32.7134 51.9239 59.2332 64.9273 68.8764 83.1883 110.6199 120.0263 130.5521 133.2322 137.5274 143.4526 158.5916 163.3087 176.0964 179.8084 230.7191 238.4695 270.0024 270.5328 275.6020 294.6952 300.8649 305.9685 306.5338 331.1050 334.5253 378.5327 393.5280 409.3366 409.6040 428.6502 441.9744 500.2419 501.1793 567.7973 569.5902 580.8262 601.7832 611.6623 613.5792 615.3517 616.9890 627.0645 648.4847 652.3855 656.4829 697.6035 697.7645 720.7570 755.1861 760.8947 764.4323 789.1888 814.7957 842.4140 842.6379 893.3123 893.5945 912.5932 913.2673 923.0452 970.5319 970.6399 985.4704 985.5647 989.4980 989.7868 999.6788 1015.2981 1028.2446 1036.5686 1039.1207 1048.2805 1049.1489 1064.9755 1067.3754 1082.8406 1092.0114 1100.5708 1120.4524 1129.3968 1132.4079 1145.4226 1171.9693 1171.9737 1183.1436 1185.5315 1190.1388 1208.1357 1252.0217 1278.6015 1297.0386 1315.4771 1316.5115 1324.6110 1331.9597 1333.3225 1382.6783 1382.7285 1388.4534 1389.8376 1414.5312 1417.2592 1434.2419 1434.2609 1444.7765 1444.9692 1448.9501 1462.7823 1465.2587 1468.0856 1470.0136 1483.9056 1484.8225 1486.7999 1490.1348 1492.3117 1492.8156 1588.3085 1588.7754 1600.0856 1603.3215 1616.2404 1618.1671 1624.8869 1630.6416 2970.8228 2970.9211 2972.5105 2972.9437 2998.1487 3050.9479 3050.9889 3055.7299 3083.3086 3083.3687 3087.5782 3087.8603 3124.2433 3124.2581 3127.8286 3127.8383 3138.3096 3138.3121 3152.3808 3152.3883 3165.2976 3165.3344 3190.6900 3190.6951
redmass: 5.0016 4.6172 5.0611 5.4726 4.5202 4.0735 4.6680 4.6445 2.5285 4.2955 1.4127 1.1837 2.5490 4.9003 2.2875 3.1038 1.2817 1.3202 3.2194 3.6608 5.6665 3.6558 4.5161 3.4327 2.1184 2.6707 5.2080 3.7187 5.0769 5.5788 5.6175 2.9804 2.9644 4.9455 5.2225 3.3215 3.3611 5.1700 5.3428 4.9020 5.7382 4.1612 6.1857 6.4446 5.7642 4.4512 6.2329 5.9990 4.7024 2.1268 2.0952 7.8371 3.2364 1.6656 2.3784 3.2114 5.6966 1.2519 1.2514 3.4076 3.2383 1.5103 1.4706 2.1968 1.3669 1.3632 3.8211 3.6286 1.5095 1.5254 3.6380 2.9777 1.9655 1.9419 1.7930 1.5039 1.6329 2.3601 2.3832 1.8996 1.7828 1.8449 2.4897 1.5980 2.0936 2.3249 1.0506 1.0506 1.2958 1.1276 1.7776 4.0491 2.2977 2.2279 2.6609 1.8730 1.7830 1.9981 2.5765 2.3810 6.0867 5.9096 3.9849 3.4231 1.3429 1.3768 1.2565 1.2471 2.1211 2.1415 1.1011 1.0594 1.0568 1.1038 1.1267 2.2649 2.2998 1.0731 1.0562 1.1054 1.1197 6.5131 6.5024 7.7309 7.2821 7.2629 8.5558 7.8759 7.5039 1.0431 1.0423 1.0375 1.0382 1.0596 1.0973 1.0973 1.1015 1.0907 1.0907 1.0998 1.0998 1.1013 1.1013 1.0851 1.0851 1.0892 1.0892 1.0941 1.0941 1.0996 1.0996 1.0958 1.0958
irintensity: 0.6897 4.5326 2.7314 2.7549 3.8156 1.1264 1.1063 0.2814 0.8822 12.3868 4.0238 0.5109 0.0571 0.0955 8.9231 1.6777 0.8280 0.2453 2.6773 0.0505 12.4345 14.4531 0.0516 0.1495 11.6453 2.8695 0.0333 0.1219 30.5874 2.2074 0.3314 0.9310 0.1592 24.6180 6.2393 12.3172 12.7912 8.0546 36.9057 2.2297 2.7329 8.2923 3.5664 2.3158 1.0175 59.3717 1.1968 6.0132 3.3624 4.9486 61.7743 17.6411 87.2773 7.9417 56.4072 17.8754 5.4607 2.0013 0.2150 9.4818 2.3923 2.7575 12.2871 3.5677 0.2241 1.7457 0.0263 0.8632 0.4374 0.6339 0.0129 18.1648 0.0242 1.0530 2.5713 13.0197 9.4886 67.1123 4.7097 12.8005 0.0000 8.7147 0.9039 29.0621 164.7803 18.9103 0.1325 0.3147 0.0332 0.7476 2.5120 15.8982 8.5808 43.2918 5.8950 184.0699 19.3029 168.0252 14.4042 89.7487 9.6542 38.8898 61.9222 20.9623 0.7768 48.9669 11.5226 12.9703 1.6536 38.1225 21.1383 81.7767 17.4102 92.5516 16.7220 263.9811 7.6247 0.8001 0.6734 9.9042 4.3684 11.8017 5.0118 30.4337 292.1149 4.1609 233.6609 176.3228 1.4679 21.1021 71.5409 77.7979 17.8445 19.3951 14.6161 26.4813 2.8108 31.7201 2.6143 0.2922 14.2199 3.8648 17.2436 3.6594 0.0979 10.6214 14.0567 47.5321 6.9581 49.1895 0.1251 2.1568 1.3358
temp: 298.150 k
press: 1.00000 atm
elementType: 8 8 7 7 7 7 6 6 6 6 6 6 6 6 6 6 6 6 6 6 6 6 6 6 6 6 6 6 6 1 1 1 1 1 1 1 1 1 1 1 1 1 1 1 1 1 1 1 1 1 1 1 1
symmnumber: 1
zpe: 1113117.7 jmol-1
zpe.correction: 0.423964 hartree
zpe.thermalcorrener: 0.451100 hartree
zpe.thermalcorrenthalpy: 0.452044 hartree
zpe.thermalcorrgfe: 0.365403 hartree
zpe.sumelectzpe: -1258.202018 hartree
zpe.sumelectthermal: -1258.174882 hartree
zpe.sumelectthermalent: -1258.173938 hartree
zpe.sumelectthermalfe: -1258.260579 hartree
dipole: -0.0044 0.0007 -3.8974
dipole: 3.8974
quadrupole: -150.9154 -154.4240 -172.5537
quadrupole: -21.7644 -0.0018 0.0007
quadrupole: 8.3823 4.8737 -13.2560 -21.7644 -0.0018 0.0007
hfenergy: -1258.6259818 hartree
pointgroup: C01 [X(C23H24N4O2)]
dipole: 0.0017219 -0.000241 -1.5333724 debye
polarizability: 425.9530885|14.2824032|298.1383339|-0.0066672|-0.0144914|165.5353944 unknown
InChI: InChI=1S/C23H24N4O2/c1-16-20(22(28)26(24(16)3)18-11-7-5-8-12-18)15-21-17(2)25(4)27(23(21)29)19-13-9-6-10-14-19/h5-14H,15H2,1-4H3
charge 0 multiplicity 1
53 atoms
O  2.357204 1.776604 0.919928
O  -2.35837 -1.776999 0.920077
N  2.832804 -1.624758 -0.038232
N  -2.832387 1.624433 -0.038578
N  3.240306 -0.249766 -0.027675
N  -3.240489 0.249617 -0.027874
C  -0.000171 -0.000598 1.85304
C  1.203209 -0.417274 1.037724
C  -1.203355 0.416367 1.037584
C  1.5544 -1.673856 0.566764
C  -1.554013 1.673048 0.566515
C  2.252597 0.531753 0.671706
C  -2.253066 -0.53228 0.671491
C  0.778996 -2.959084 0.612821
C  -0.778035 2.957934 0.612524
C  4.61159 0.101414 -0.209981
C  -4.611941 -0.100985 -0.210039
C  3.118891 -2.380972 -1.279741
C  -3.118058 2.380633 -1.280193
C  4.932076 1.413869 -0.643551
C  -4.933019 -1.413317 -0.643544
C  5.646433 -0.832948 0.058913
C  -5.64637 0.83381 0.058949
C  6.284544 1.776913 -0.81292
C  -6.285656 -1.775801 -0.812768
C  6.993471 -0.459722 -0.133928
C  -6.993583 0.46114 -0.133742
C  7.320936 0.844397 -0.571728
C  -7.321635 -0.842849 -0.571487
H  0.311159 0.834644 2.50734
H  -0.311594 -0.835914 2.507208
H  1.313797 -3.733077 1.194674
H  0.597368 -3.36626 -0.400025
H  -0.211688 -2.78298 1.063353
H  -1.312489 3.732191 1.194342
H  -0.596203 3.364988 -0.400334
H  0.212554 2.781395 1.063095
H  2.904983 -3.444748 -1.094001
H  4.183768 -2.279922 -1.538228
H  2.505777 -2.022669 -2.130426
H  -2.505014 2.02199 -2.130785
H  -2.903735 3.444341 -1.094548
H  -4.182952 2.279991 -1.53877
H  4.127681 2.13186 -0.817223
H  -4.128942 -2.131647 -0.817283
H  5.392927 -1.824018 0.449588
H  -5.392417 1.824775 0.449599
H  6.528076 2.793586 -1.140713
H  -6.529645 -2.792379 -1.140515
H  7.787817 -1.184839 0.075839
H  -7.787606 1.186588 0.076102
H  8.367985 1.132354 -0.71445
H  -8.368818 -1.130375 -0.714093
