program: Gaussian 09
title: 000010679
version: EM64L-G09RevD.01
frameworkgroup: C1[X(C13H12N2)]
method: RPBEPBE
basis: SDD
operation: Freq
keyword: #pfreq=noraman
keyword: PBEPBE/SDD
title: #p freq=noraman PBEPBE/SDD
converged: NO NO NO NO
title: Mulliken charges:
elementType: N N C C C C C C C C C C C C C H H H H H H H H H H H H
charge: -0.710272 -0.710275 -0.703887 0.307935 0.307953 0.194915 0.194916 -0.648316 -0.648312 -0.391724 -0.391730 0.539242 0.539245 -0.449533 -0.449533 0.237468 0.237461 0.227661 0.227662 0.230450 0.230453 0.211357 0.211356 0.301529 0.301226 0.301528 0.301226
chargesum: 0.00000
title: Mulliken charges with hydrogens summed into heavy atoms:
elementType: N N C C C C C C C C C C C C C
charge: -0.107518 -0.107521 -0.228958 0.307935 0.307953 0.194915 0.194916 -0.420654 -0.420650 -0.161274 -0.161278 0.539242 0.539245 -0.238177 -0.238177
polarizability: 2.95694162e+02 -7.96275270e-06 1.53568758e+02 7.37957388e-04 8.29326124e-04 6.53079735e+01
1716.lowfreq: -0.0010 -0.0005 0.0008 4.7421 8.5650 21.7151 61.9038 120.8192 158.5326
frequency: 61.9012 120.8190 158.5326 177.8351 231.9404 255.9098 304.7452 308.2284 315.3760 322.4046 353.3113 353.8528 389.2371 408.3092 425.8438 433.6578 507.9235 524.6763 541.0501 571.4637 602.7740 625.8381 710.3394 718.5302 729.2971 754.7555 770.7442 810.5305 816.4389 846.1877 863.6854 920.9992 929.4381 933.8366 934.6600 958.9077 989.9099 1028.9053 1034.3089 1105.4111 1132.4179 1133.8773 1151.9873 1156.9741 1197.5916 1226.6202 1276.5382 1301.4732 1318.0098 1330.1852 1377.1780 1391.1186 1426.4753 1463.1258 1466.1008 1478.4598 1502.4190 1585.4985 1594.5383 1633.1451 1633.2868 1639.9497 1640.6010 2984.5355 3032.6069 3108.7753 3109.2359 3111.2079 3112.6618 3136.0494 3138.3169 3570.0244 3570.6742 3713.5840 3713.5962
redmass: 4.7910 3.8548 4.4740 4.1735 2.0573 3.7279 1.2232 1.3194 5.1545 3.2126 1.0466 1.0471 5.6705 3.3111 2.4769 2.7183 3.9451 5.3664 2.9163 5.7103 2.6904 5.7483 2.8669 5.5003 5.4214 3.3413 5.7280 1.4659 1.6059 1.5022 1.5189 3.3962 2.5173 1.4084 1.4107 2.1897 6.3481 1.4889 1.4381 2.3012 1.7550 1.1427 1.3150 1.5678 1.6072 1.5431 1.6479 1.6966 2.1829 5.9937 7.3169 3.3143 1.1353 5.4144 4.0311 3.2935 4.3984 7.4794 6.5695 1.6483 1.9022 2.4936 2.1024 1.0600 1.1002 1.0909 1.0912 1.0871 1.0873 1.0967 1.0964 1.0443 1.0445 1.1042 1.1043
irintensity: 5.0396 0.0000 3.2998 0.0000 12.6862 22.8219 0.0235 620.2985 2.0116 0.2166 0.0000 0.0013 0.0000 0.9337 9.2523 0.0000 0.0164 18.7671 3.6836 2.6633 0.0000 0.1059 9.4367 0.0006 5.4817 0.0000 0.3709 94.6423 0.0000 48.4715 0.0000 0.2948 6.6889 2.3344 0.0000 19.9279 2.5164 3.0961 0.7857 2.3497 59.8990 0.0000 0.2745 9.7822 0.0030 3.5427 63.3526 2.6695 90.9275 24.8578 42.2876 4.8719 11.0691 0.0900 4.1029 330.2988 0.0617 37.2193 13.0208 11.0609 0.9909 660.8254 13.6975 21.7588 10.4841 6.3308 35.3438 63.7066 2.0086 15.4252 39.7441 185.7289 3.1825 7.2853 29.6105
temp: 298.150 k
press: 1.00000 atm
elementType: 7 7 6 6 6 6 6 6 6 6 6 6 6 6 6 1 1 1 1 1 1 1 1 1 1 1 1
symmnumber: 1
zpe: 569490.4 jmol-1
zpe.correction: 0.216907 hartree
zpe.thermalcorrener: 0.229438 hartree
zpe.thermalcorrenthalpy: 0.230382 hartree
zpe.thermalcorrgfe: 0.179250 hartree
zpe.sumelectzpe: -611.076982 hartree
zpe.sumelectthermal: -611.064451 hartree
zpe.sumelectthermalent: -611.063507 hartree
zpe.sumelectthermalfe: -611.114639 hartree
dipole: 0.0000 1.3200 0.0047
dipole: 1.3201
quadrupole: -48.6326 -74.5796 -96.3127
quadrupole: -0.0002 -0.0065 0.0028
quadrupole: 24.5423 -1.4047 -23.1377 -0.0002 -0.0065 0.0028
hfenergy: -611.2938892 hartree
pointgroup: C01 [X(C13H12N2)]
dipole: 0.0000162 0.519345 -0.0018632 debye
polarizability: 295.694162|-0.000182|153.5687581|0.000738|-0.0008293|65.3079735 unknown
InChI: InChI=1S/C13H12N2/c14-10-1-3-12-8(6-10)5-9-7-11(15)2-4-13(9)12/h1-4,6-7H,5,14-15H2
charge 0 multiplicity 1
27 atoms
N  4.891626 0.362382 0.000294
N  -4.891614 0.36239 0.000212
C  0.000005 1.791399 -0.000034
C  1.195858 0.837954 0.000001
C  -1.195839 0.837964 -0.000001
C  0.736757 -0.515738 -0.000006
C  -0.736755 -0.515721 -0.000002
C  2.563961 1.144734 0.000039
C  -2.563946 1.144745 0.000028
C  1.680105 -1.568117 0.000038
C  -1.680098 -1.56811 0.000025
C  3.518083 0.081637 0.000099
C  -3.518063 0.081652 0.000076
C  3.060031 -1.269815 0.000081
C  -3.06002 -1.269808 0.000073
H  0.000015 2.44818 0.891483
H  0.00002 2.44813 -0.891592
H  2.906772 2.187718 0.000044
H  -2.906758 2.187727 0.000031
H  1.354955 -2.615248 0.000011
H  -1.35494 -2.615236 0.000031
H  3.794569 -2.085172 0.000135
H  -3.79456 -2.085166 0.000114
H  5.225232 1.321078 -0.000519
H  5.572922 -0.39002 -0.000497
H  -5.225223 1.321085 -0.000313
H  -5.572897 -0.390023 -0.000251
