program: Gaussian 09
title: 000096146
version: EM64L-G09RevD.01
frameworkgroup: C1[X(C16H14N4O2)]
method: RPBEPBE
basis: SDD
operation: Freq
keyword: #p
keyword: freq=noraman
keyword: PBEPBE/SDD
title: #p freq=noraman PBEPBE/SDD
converged: YES YES NO NO
title: Mulliken charges:
elementType: O O N N N N C C C C C C C C C C C C C C C C H H H H H H H H H H H H H H
charge: -0.233979 -0.233959 0.043846 0.043898 -0.364148 -0.364175 0.437813 0.437819 -0.375025 -0.375035 -0.358357 -0.358372 -0.223161 -0.223162 -0.218488 -0.218488 -0.229286 -0.229293 -0.360699 -0.360698 0.127000 0.126918 0.226245 0.226245 0.281030 0.281019 0.231135 0.231130 0.232206 0.232200 0.232712 0.232710 0.213641 0.213625 0.337589 0.337546
chargesum: 0.00000
title: Mulliken charges with hydrogens summed into heavy atoms:
elementType: O O N N N N C C C C C C C C C C C C C C C C
charge: -0.233979 -0.233959 0.043846 0.043898 -0.026559 -0.026628 0.437813 0.437819 -0.148780 -0.148790 -0.077327 -0.077353 0.007974 0.007968 0.013718 0.013712 0.003425 0.003416 -0.147058 -0.147072 0.127000 0.126918
polarizability: 5.56315067e+02 2.21076073e+01 2.05710678e+02 1.59284694e-02 1.19007926e-02 7.82821850e+01
1716.lowfreq: 0.0002 0.0013 0.0015 3.0569 5.6876 16.5164 18.3157 29.0858 35.9027
frequency: 18.3139 29.0858 35.9026 53.1662 58.8694 66.7243 84.8101 136.9676 147.2682 152.7932 157.1489 225.1380 238.2888 247.1897 268.3506 308.7470 336.0489 342.8574 381.9861 404.7794 404.7931 452.3357 487.9670 494.0311 514.5715 516.0750 526.6137 614.6690 614.9856 627.6189 651.2964 698.3885 698.5043 760.7423 768.5868 771.5027 779.9040 782.0067 790.0262 836.8879 856.8797 856.8912 868.4455 926.0367 926.0473 959.2920 959.6647 967.8044 987.6637 987.6727 987.7532 988.0337 1007.8330 1007.8574 1020.4696 1023.8623 1025.3589 1073.1539 1086.3537 1095.6853 1174.3445 1174.5624 1176.6168 1184.5288 1185.2653 1191.8448 1241.6476 1242.8942 1316.6606 1318.3984 1341.3869 1349.9656 1390.2262 1391.2367 1438.5274 1438.9471 1480.7324 1482.2502 1507.1168 1512.2336 1564.9811 1567.7289 1594.0748 1595.4203 1612.6250 1613.1872 1629.2209 1639.7322 2976.1694 2976.2911 3118.1685 3118.1936 3132.0532 3132.0646 3145.0667 3145.0757 3159.1560 3159.1762 3170.0374 3170.0976 3317.9460 3317.9833
redmass: 7.4017 6.2967 3.6212 5.7625 6.8297 5.9844 6.0975 6.2816 7.2496 5.8937 7.1959 6.4824 2.9913 2.8207 8.6016 5.2135 5.2991 6.5626 7.6641 2.8273 2.8276 6.9504 5.1654 6.9184 3.0945 9.1327 4.0968 6.4876 6.4864 6.2234 6.2990 1.7712 1.7721 2.3663 1.3439 1.9844 1.3897 1.6284 8.1698 5.1485 1.2522 1.2522 4.8712 1.3693 1.3688 1.5838 1.5817 6.3240 1.3761 1.3765 6.2694 6.3077 1.3381 1.3382 4.4859 2.1573 2.6405 2.7094 1.5996 2.3908 1.1309 1.0591 2.2628 1.1875 1.1225 2.2646 1.9202 1.9182 1.5589 1.5099 1.4533 1.6400 6.7603 6.2210 2.3402 2.3380 2.1660 2.2162 2.1546 2.2946 5.8017 5.7121 5.5799 5.4970 6.0885 5.9820 6.8071 10.6697 1.0875 1.0875 1.0878 1.0878 1.0870 1.0870 1.0921 1.0921 1.0962 1.0961 1.1007 1.1007 1.0752 1.0749
irintensity: 1.0452 0.5481 0.5774 0.0000 0.0000 0.0000 2.9856 25.5837 0.0001 0.0003 3.6160 0.0001 48.9438 0.0000 17.0033 6.5654 0.0008 86.6890 0.0000 0.1468 0.0025 10.9083 1.9057 0.0000 0.0000 0.0026 22.9121 0.0059 0.0000 8.3225 0.0001 0.0094 100.0559 0.0081 268.5815 0.0004 15.1166 0.0056 88.2912 0.0001 1.0401 0.1706 45.4272 0.0775 6.0245 0.0220 81.1592 0.0000 0.1574 0.0162 0.3193 0.0000 0.1275 2.8661 97.0694 0.0012 6.7243 0.0002 12.5202 0.0000 5.8834 0.0001 108.6692 0.0001 26.5463 0.0011 0.0000 77.3016 27.3085 0.0000 104.7337 0.0006 16.6544 0.0001 28.9106 0.0000 210.0861 0.0011 0.0620 809.5390 72.5353 0.0076 36.3733 0.0052 0.0011 11.1948 688.6335 0.0227 49.3992 41.2656 6.8310 9.0884 0.2533 0.0009 4.2614 40.3548 47.5357 0.4322 55.6514 0.1140 37.8416 16.9201
temp: 298.150 k
press: 1.00000 atm
elementType: 8 8 7 7 7 7 6 6 6 6 6 6 6 6 6 6 6 6 6 6 6 6 1 1 1 1 1 1 1 1 1 1 1 1 1 1
symmnumber: 1
zpe: 714724.1 jmol-1
zpe.correction: 0.272224 hartree
zpe.thermalcorrener: 0.291384 hartree
zpe.thermalcorrenthalpy: 0.292328 hartree
zpe.thermalcorrgfe: 0.221720 hartree
zpe.sumelectzpe: -985.972940 hartree
zpe.sumelectthermal: -985.953780 hartree
zpe.sumelectthermalent: -985.952836 hartree
zpe.sumelectthermalfe: -986.023445 hartree
dipole: -0.0020 -0.0005 0.0071
dipole: 0.0074
quadrupole: -74.4295 -120.3440 -134.3259
quadrupole: 14.4993 0.0014 0.0150
quadrupole: 35.2703 -10.6442 -24.6261 14.4993 0.0014 0.0150
hfenergy: -986.2451643 hartree
pointgroup: C01 [X(C16H14N4O2)]
dipole: 0.0007601 0.0027885 -0.0002106 debye
polarizability: 554.8601702|0.6437161|78.2923151|-31.5649476|-1.1262754|207.1554452 unknown
InChI: InChI=1S/C16H14N4O2/c21-15(19-17-11-13-7-3-1-4-8-13)16(22)20-18-12-14-9-5-2-6-10-14/h1-12,19-20H
charge 0 multiplicity 1
36 atoms
O  0.663936 -0.366092 1.674664
O  -0.659246 -0.335456 -1.675834
N  3.04155 -0.347349 0.036013
N  -3.036874 -0.35278 -0.037652
N  1.743418 -0.343393 -0.442498
N  -1.738936 -0.355026 0.440995
C  5.412348 -0.340896 -0.474961
C  -5.407682 -0.358316 0.473443
C  6.413937 -0.33182 -1.485173
C  -6.409197 -0.366689 1.483741
C  5.804979 -0.352716 0.895092
C  -5.800461 -0.348023 -0.896586
C  7.781255 -0.334577 -1.136926
C  -7.776551 -0.36518 1.135616
C  7.170049 -0.355448 1.236951
C  -7.165565 -0.346659 -1.238325
C  8.163429 -0.346403 0.224571
C  -8.158859 -0.355229 -0.225854
C  4.000164 -0.33787 -0.869833
C  -3.99544 -0.360759 0.868223
C  0.657592 -0.352931 0.409127
C  -0.652779 -0.346874 -0.410335
H  6.11834 -0.322634 -2.542091
H  -6.113498 -0.374511 2.540637
H  5.026104 -0.359614 1.664244
H  -5.021645 -0.341561 -1.665797
H  8.545334 -0.327586 -1.921834
H  -8.540555 -0.37178 1.920604
H  7.467049 -0.364547 2.29149
H  -7.462661 -0.338829 -2.292848
H  9.224766 -0.348526 0.496777
H  -9.22022 -0.354081 -0.497973
H  3.785264 -0.328217 -1.958211
H  -3.780366 -0.368746 1.956594
H  1.510935 -0.333389 -1.453861
H  -1.506213 -0.363294 1.452311
