program: Gaussian 09
title: 000096105
version: EM64L-G09RevD.01
frameworkgroup: C1[X(C7H16Cl2N3OP)]
method: RPBEPBE
basis: SDD
operation: Freq
keyword: #p
keyword: freq=noraman
keyword: PBEPBE/SDD
title: #p freq=noraman PBEPBE/SDD
converged: YES YES NO NO
title: Mulliken charges:
elementType: Cl Cl P O N N N C C C C C C C H H H H H H H H H H H H H H H H
charge: -0.069999 -0.072783 1.336754 -0.596465 -0.512548 -0.691762 -0.717130 -0.316224 -0.363623 -0.356016 -0.297866 -0.287717 -0.563768 -0.564127 0.228932 0.201213 0.216246 0.230935 0.228771 0.216457 0.326998 0.332540 0.275861 0.227600 0.259307 0.234386 0.291315 0.254063 0.288468 0.260181
chargesum: 0.00000
title: Mulliken charges with hydrogens summed into heavy atoms:
elementType: Cl Cl P O N N N C C C C C C C
charge: -0.069999 -0.072783 1.336754 -0.596465 -0.512548 -0.364763 -0.384590 0.113921 0.083558 0.089212 0.205596 0.205976 -0.018391 -0.015478
polarizability: 1.69910282e+02 -4.36668814e+00 1.39615145e+02 -5.84386872e+00 4.23512222e+00 1.08951174e+02
1716.lowfreq: -6.9923 -4.6671 -0.0021 -0.0009 0.0008 3.9261 25.9533 30.4341 38.3256
frequency: 25.9298 30.3712 38.1727 57.3203 72.8605 87.6390 92.5871 116.6730 149.4139 192.9778 207.4785 215.1657 221.8485 263.5953 292.3318 316.9617 333.4130 360.9261 416.2608 438.5552 464.4677 468.1585 503.6904 564.2794 649.8785 682.3629 684.5941 732.1338 774.0974 778.8648 787.6769 843.5896 890.0325 952.5575 958.9244 980.6372 1001.0332 1012.2768 1040.7991 1049.3959 1061.6574 1102.6696 1112.0677 1118.4331 1129.9286 1194.9847 1206.3827 1213.2130 1231.3213 1251.5459 1252.3659 1269.9323 1291.6553 1329.9894 1333.2245 1336.2771 1345.4290 1347.6319 1367.6190 1405.0616 1428.2926 1444.7394 1446.8035 1451.1080 1457.1705 1471.1660 1476.4384 1489.2852 2936.0464 2940.6766 2999.4535 3003.3146 3013.9353 3035.6794 3041.0612 3054.3964 3057.2979 3068.3657 3073.4291 3085.1443 3146.6445 3149.8270 3506.0741 3533.5873
redmass: 8.0649 6.3128 5.6481 5.0514 2.6929 3.7418 2.2920 3.4889 2.3511 4.1356 6.3445 4.2994 9.0085 4.1823 2.5420 3.0069 2.9599 3.2919 2.7088 3.3374 2.2774 2.7164 2.4866 2.8739 4.2491 5.0132 3.6938 3.9225 1.1897 1.2164 3.6036 2.5041 1.3481 2.5994 2.6536 2.4040 1.4276 9.3646 2.0586 4.1337 2.1878 1.8711 3.0109 1.4928 3.3431 1.1436 1.1505 2.6862 1.5953 1.1737 1.1721 1.1662 1.1908 1.2108 1.1721 1.2427 1.3201 1.2845 1.2320 1.4084 1.3046 1.0886 1.0923 1.0935 1.0846 1.0757 1.0767 1.0784 1.0686 1.0679 1.0616 1.0620 1.0615 1.0943 1.0931 1.0567 1.0593 1.0987 1.1036 1.1025 1.1126 1.1123 1.0752 1.0757
irintensity: 0.5531 0.1563 0.7652 2.1053 3.2610 5.0663 2.4253 5.1912 1.2832 3.7609 3.3947 0.5261 11.1847 3.9450 8.5263 16.9635 21.5269 4.3911 31.8235 11.7613 81.0498 104.0843 63.6235 9.7945 5.7690 84.9550 54.0608 212.6333 16.9960 8.8055 73.8958 29.7231 0.5933 59.7160 63.5758 9.5150 1.2035 108.8455 13.5138 4.4014 28.8415 4.9924 177.3117 21.2629 9.8498 0.7186 0.5151 75.5336 11.9698 7.5261 14.1648 1.5780 11.3434 6.1713 26.1106 103.8222 1.2142 4.4377 0.5272 8.2690 27.0430 1.5819 15.6255 6.8548 27.1882 15.3687 5.3271 3.8435 39.6583 131.2999 18.8562 15.9120 17.5416 34.4224 37.1867 14.1619 19.0332 7.2870 46.9742 1.2141 9.2700 10.1451 16.2385 18.9335
temp: 298.150 k
press: 1.00000 atm
elementType: 17 17 15 8 7 7 7 6 6 6 6 6 6 6 1 1 1 1 1 1 1 1 1 1 1 1 1 1 1 1
symmnumber: 1
zpe: 633789.1 jmol-1
zpe.correction: 0.241398 hartree
zpe.thermalcorrener: 0.258457 hartree
zpe.thermalcorrenthalpy: 0.259401 hartree
zpe.thermalcorrgfe: 0.193607 hartree
zpe.sumelectzpe: -1776.011454 hartree
zpe.sumelectthermal: -1775.994394 hartree
zpe.sumelectthermalent: -1775.993450 hartree
zpe.sumelectthermalfe: -1776.059244 hartree
dipole: -5.2865 -0.0128 1.1400
dipole: 5.4080
quadrupole: -108.7805 -128.0364 -98.0030
quadrupole: 11.8642 1.8384 -8.6264
quadrupole: 2.8262 -16.4298 13.6036 11.8642 1.8384 -8.6264
hfenergy: -1776.2528511 hartree
pointgroup: C01 [X(C7H16Cl2N3O1P1)]
dipole: 1.865392 0.6772222 -0.7672633 debye
polarizability: 160.0957555|12.9514002|136.3062503|-7.943106|-20.0080732|122.0745944 unknown
InChI: InChI=1S/C7H16Cl2N3OP/c8-2-6-12(7-3-9)14(13)10-4-1-5-11-14/h10-11H,1-7H2
charge 0 multiplicity 1
30 atoms
Cl -4.117188 -2.67792 0.983173
Cl -1.608785 3.245336 -2.0365
P  0.739054 -0.68371 0.620867
O  0.604318 -1.753805 1.809593
N  -0.87429 -0.24425 0.095992
N  1.585726 0.81404 0.972577
N  1.566659 -1.132154 -0.847195
C  3.297666 0.660151 -0.831176
C  3.022034 1.017921 0.641251
C  2.993272 -0.823086 -1.118293
C  -2.045529 -0.786146 0.81898
C  -1.089046 0.671581 -1.0402
C  -2.492949 -2.114816 0.188271
C  -1.271543 2.117981 -0.549959
H  2.68128 1.300558 -1.487928
H  4.362965 0.857031 -1.055333
H  3.691495 0.421515 1.300008
H  3.251037 2.085378 0.81487
H  3.181875 -1.043589 -2.18508
H  3.677464 -1.464368 -0.520125
H  1.287742 1.236901 1.858453
H  1.206959 -1.985181 -1.284081
H  -1.784987 -0.960953 1.876515
H  -2.87028 -0.050661 0.780544
H  -0.221471 0.615848 -1.721146
H  -1.980903 0.353611 -1.613007
H  -1.766994 -2.916456 0.387842
H  -2.707007 -2.021751 -0.887549
H  -0.354659 2.498446 -0.07854
H  -2.142417 2.237346 0.112176
