program: Gaussian 09
title: 000096106
version: EM64L-G09RevD.01
frameworkgroup: C1[X(C12H7Cl2NO3)]
method: RPBEPBE
basis: SDD
operation: Freq
keyword: #p
keyword: freq=noraman
keyword: PBEPBE/SDD
title: #p freq=noraman PBEPBE/SDD
converged: NO YES NO YES
title: Mulliken charges:
elementType: Cl Cl O O O N C C C C C C C C C C C C H H H H H H H
charge: 0.002620 0.002620 -0.267254 -0.214149 -0.214698 0.021733 0.385854 0.517053 -0.341762 -0.290127 0.382664 -0.329064 -0.352988 -0.265243 -0.265235 -0.227156 -0.227161 -0.209606 0.270662 0.264129 0.291127 0.287690 0.266091 0.266093 0.246110
chargesum: 0.00000
title: Mulliken charges with hydrogens summed into heavy atoms:
elementType: Cl Cl O O O N C C C C C C C C C C C C
charge: 0.002620 0.002620 -0.267254 -0.214149 -0.214698 0.021733 0.385854 0.517053 -0.071100 -0.025999 0.382664 -0.037937 -0.065298 -0.265243 -0.265235 0.038935 0.038931 0.036504
polarizability: 2.46613374e+02 2.64462073e-03 1.40888642e+02 -1.97530056e+01 -8.61366531e-03 1.32814758e+02
1716.lowfreq: -5.9642 -0.0003 0.0006 0.0025 1.0736 4.0645 12.5599 32.2671 50.9067
frequency: 12.3741 32.2427 50.8980 74.7704 86.0577 87.8183 157.2974 193.8500 205.5799 234.9995 262.5636 296.8726 302.4515 366.5425 382.3628 416.0552 420.7185 485.4154 502.0503 511.7251 513.0420 514.1748 600.5636 620.0274 635.4301 661.7050 716.5493 727.3960 746.3745 750.9320 775.8107 794.5288 829.1743 855.5521 858.1634 892.9686 969.0039 979.4343 989.3669 996.3878 1048.5752 1067.0695 1094.7968 1107.5592 1158.5792 1159.6954 1188.6957 1197.9136 1221.7342 1234.1862 1286.4298 1356.6094 1360.5200 1405.6442 1423.2465 1426.8215 1431.4079 1472.6464 1568.8120 1577.8830 1596.5833 1612.5148 3156.9445 3162.2845 3172.9617 3174.9143 3186.3038 3186.5333 3192.1591
redmass: 16.2719 6.2713 6.7326 6.4509 15.8086 9.4159 15.2592 4.7830 10.6910 10.1709 9.1069 6.4367 8.2467 13.8889 7.8468 2.9977 7.5580 3.1991 6.8283 5.6333 5.4936 6.7237 5.3768 7.9209 6.7795 4.6867 5.8656 5.0297 9.2309 6.0008 1.4183 8.2928 1.2561 1.6157 6.6156 1.3559 1.3257 1.3293 1.3447 2.9143 4.3144 2.9892 3.1892 1.2397 1.3581 1.4446 2.6946 1.4510 5.1450 4.2398 1.2712 8.5280 11.3303 7.2232 2.2512 3.6951 4.4251 2.4708 7.3454 7.6119 7.7896 7.0630 1.0874 1.0895 1.0893 1.0931 1.0997 1.0957 1.0974
irintensity: 0.0048 0.0243 0.9495 0.0170 0.3128 4.0927 1.9850 0.0000 3.3730 1.8234 3.2670 0.1046 0.1619 2.9579 2.1862 0.0124 0.9100 9.3067 4.8531 0.2931 0.9286 1.8183 0.5214 8.6146 0.4764 14.1208 13.7203 12.1644 76.8622 8.5464 63.2338 10.7963 1.6551 68.2417 48.5681 0.0004 0.5910 3.5471 0.0499 5.2362 30.4547 7.6747 14.9732 22.6709 4.4428 204.2557 8.6853 8.1254 723.8932 80.9578 1.3695 98.0782 0.4277 8.7596 53.0484 167.4339 16.5384 89.5556 36.0448 14.1237 52.5749 171.2774 3.2395 3.3877 0.4164 0.3363 4.4825 1.5974 3.8847
temp: 298.150 k
press: 1.00000 atm
elementType: 17 17 8 8 8 7 6 6 6 6 6 6 6 6 6 6 6 6 1 1 1 1 1 1 1
symmnumber: 1
zpe: 429096.0 jmol-1
zpe.correction: 0.163434 hartree
zpe.thermalcorrener: 0.178960 hartree
zpe.thermalcorrenthalpy: 0.179905 hartree
zpe.thermalcorrgfe: 0.117306 hartree
zpe.sumelectzpe: -1660.660275 hartree
zpe.sumelectthermal: -1660.644748 hartree
zpe.sumelectthermalent: -1660.643804 hartree
zpe.sumelectthermalfe: -1660.706403 hartree
dipole: -7.4487 -0.0012 0.6875
dipole: 7.4803
quadrupole: -133.6220 -116.9461 -113.5467
quadrupole: -0.0016 -16.7462 -0.0032
quadrupole: -12.2504 4.4254 7.8249 -0.0016 -16.7462 -0.0032
hfenergy: -1660.8237086 hartree
pointgroup: C01 [X(C12H7Cl2N1O3)]
dipole: 2.9299449 -0.0000877 0.2767247 debye
dipolederiv: -0.1618037 -0.2189905 -0.088706 -0.1727974 -0.5723863 -0.1447733 -0.0786046 -0.1502578 -0.0808576 -0.1618759 0.2192814 -0.0880897 0.1730862 -0.5731908 0.1433358 -0.0781174 0.1488159 -0.0800092 -2.3862704 0.0001331 -0.0549882 0.0003317 -0.2246717 0.0001769 -0.1665452 0.0001563 -0.3395889 -0.971661 0.0003224 -0.1666086 0.000123 -0.2319516 0.0003284 -0.2515962 0.0005807 -0.5495522 -0.6686388 -0.0002389 0.1692409 -0.0006143 -0.2310049 0.0010185 0.3507043 0.0006864 -0.8002593 2.1000866 0.0002122 -0.1747554 0.0005508 0.1880342 -0.0013833 -0.3200027 -0.0013881 1.135289 2.1044525 0.0001495 -0.1316906 0.0006564 0.1414986 -0.0001752 -0.5622903 -0.0001662 0.2714018 1.1850317 -0.0002131 0.1493816 -0.0010857 -0.2360292 -0.0006053 0.8090968 -0.0006016 0.1655235 -0.7136304 -0.0000107 0.0110727 0.0003215 -0.1454496 -0.0003084 -0.2249386 -0.0003029 0.1003539 -0.4661141 -0.0001523 0.1140571 -0.0007379 -0.1349636 0.0000517 0.5911904 0.0000513 -0.1823724 -0.9712312 -0.0002591 0.1650486 -0.0002592 0.0308323 0.0001887 0.2608095 0.0002349 -0.1208325 0.3182651 0.0000174 -0.0315647 0.0005695 -0.0912612 -0.0002395 -0.3647731 -0.0002274 0.0855178 0.4845911 0.0000995 -0.0878215 -0.0001324 -0.0808079 -0.0001325 0.1301261 -0.000091 0.0048679 0.0669612 0.3362066 0.1878095 0.2402248 0.8496794 0.2335987 0.0733999 0.2179773 0.0599245 0.0670381 -0.3368033 0.1868667 -0.240545 0.8508818 -0.2312777 0.0727253 -0.2156432 0.0586153 -0.1524768 -0.1357065 -0.0186029 -0.0689 -0.1731395 -0.0781904 -0.0181175 -0.089129 -0.1082392 -0.1524828 0.135758 -0.0182178 0.0689478 -0.173595 0.0779989 -0.0179343 0.0889288 -0.1077586 0.0172004 -0.0001682 0.1122355 -0.0001429 0.1148351 0.0002694 0.0956801 0.0002745 -0.065307 0.0961907 -0.0000579 0.045578 -0.0000928 0.1572711 0.0001953 0.0464573 0.0001997 -0.0026499 0.0204156 0.0000876 -0.0657471 0.0001366 0.1321779 0.0001227 -0.1124711 0.0001185 0.0433119 0.072484 0.0000947 -0.0669198 0.0000198 0.166243 0.000097 -0.0185342 0.0000939 0.0913744 0.1111217 -0.0000393 0.0334448 0.0000142 0.1632597 0.000158 0.0020335 0.0001448 0.0436276 0.0868957 0.0319202 -0.0378665 0.0488391 0.0026342 0.0277038 -0.0511799 0.0234265 0.1422167 0.0869074 -0.0317938 -0.037956 -0.0486788 0.0027752 -0.0281149 -0.0513165 -0.0238365 0.1420684 -0.0114568 0.0001508 -0.1052004 0.000165 0.0683288 -0.0000435 -0.1158017 -0.0000457 0.0933342 unknown
polarizability: 246.5286943|-0.0329621|140.888599|19.9952337|0.0201003|132.8994804 unknown
InChI: InChI=1S/C12H7Cl2NO3/c13-10-2-1-3-11(14)12(10)18-9-6-4-8(5-7-9)15(16)17/h1-7H
charge 0 multiplicity 1
25 atoms
Cl 1.900662 -2.779451 -0.474971
Cl 1.900333 2.780537 -0.466863
O  0.944341 0.001574 -1.238187
O  -5.357215 0.000464 -0.388398
O  -4.68743 -0.002665 1.793924
N  -4.440357 -0.00038 0.523972
C  -0.367746 0.000948 -0.724294
C  2.049753 0.00039 -0.363363
C  -1.391355 0.002224 -1.701775
C  -0.66542 -0.000794 0.659448
C  -3.029529 0.000077 0.090288
C  -2.733437 0.001786 -1.293782
C  -2.010682 -0.001241 1.068363
C  2.65989 -1.215779 0.026927
C  2.659732 1.215493 0.030483
C  3.842009 -1.229147 0.791858
C  3.841843 1.226785 0.795457
C  4.428572 -0.001698 1.173073
H  -1.114019 0.003535 -2.75905
H  0.137114 -0.001787 1.402577
H  -3.552225 0.002749 -2.017367
H  -2.28523 -0.002572 2.126267
H  4.293173 -2.182809 1.078324
H  4.292881 2.179665 1.084705
H  5.348839 -0.002504 1.764783
