program: Gaussian 09
title: 000096107
version: EM64L-G09RevD.01
frameworkgroup: C1[X(C10H11BrO2)]
method: RPBEPBE
basis: SDD
operation: Freq
keyword: #p
keyword: freq=noraman
keyword: PBEPBE/SDD
title: #p freq=noraman PBEPBE/SDD
converged: YES YES NO NO
title: Mulliken charges:
elementType: Br O O C C C C C C C C C C H H H H H H H H H H H
charge: 0.011101 -0.288044 -0.218240 -0.339479 -0.486879 -0.682482 0.218521 0.367716 -0.305236 -0.386946 -0.160314 -0.150605 -0.230645 0.220909 0.216349 0.244994 0.245633 0.209127 0.209496 0.225461 0.309042 0.263594 0.252268 0.254660
chargesum: 0.00000
title: Mulliken charges with hydrogens summed into heavy atoms:
elementType: Br O O C C C C C C C C C C
charge: 0.011101 -0.288044 -0.218240 0.097778 0.003749 -0.038397 0.218521 0.367716 0.003806 -0.123353 0.091953 0.104055 -0.230645
polarizability: 2.21387450e+02 -3.85962528e-01 1.16017256e+02 -5.66972306e-01 4.85686914e-02 6.30189456e+01
1716.lowfreq: -5.0534 -1.1451 -0.0005 -0.0004 -0.0002 4.7340 16.4848 30.0506 35.9771
frequency: 16.1292 30.0264 35.9294 68.7384 84.5918 139.6759 161.5623 198.7735 227.6269 260.1376 322.6961 326.0045 354.8566 382.1745 412.0525 501.9976 535.7459 601.5989 615.1041 698.0213 701.9722 735.0776 764.0737 824.0968 839.5396 865.5841 872.7907 925.7311 955.8427 976.4922 990.7912 1049.9253 1057.4842 1085.6230 1100.7571 1109.4404 1123.0274 1155.9816 1193.1805 1219.0305 1283.8384 1287.2949 1289.3529 1358.6781 1365.6947 1393.3692 1393.9392 1436.9694 1461.2058 1473.2934 1479.3311 1485.8387 1576.0027 1594.1495 1655.4048 2975.0832 2985.5170 3003.9491 3030.6941 3051.7011 3078.3792 3079.2688 3161.1429 3166.2689 3181.0255 3212.3968
redmass: 2.1320 3.0583 6.9081 4.8514 3.4023 5.9773 5.8230 8.2933 1.0756 5.2277 6.6501 5.2586 5.1757 4.4698 3.0017 2.8409 2.8271 7.9451 7.1495 6.5184 3.7742 1.1711 7.3242 1.2971 1.4419 1.3247 3.2554 2.5099 1.3408 1.3303 5.0903 2.4000 2.5056 3.1934 1.5826 1.3710 2.4405 2.0523 1.5995 1.3337 1.1901 1.2408 1.3397 1.7263 6.2908 1.2136 3.5032 1.0861 2.2865 1.0539 1.0421 1.0788 7.2501 6.9574 10.1784 1.0362 1.0618 1.0608 1.0972 1.1004 1.1021 1.0989 1.0887 1.0918 1.0975 1.0946
irintensity: 0.0125 0.8094 0.6870 0.2094 1.1232 1.8084 0.7054 1.6149 0.0406 11.5907 3.1875 1.9684 3.2914 4.7657 0.0515 25.3031 0.3877 10.0392 0.7825 8.7865 0.0548 13.8425 17.5502 12.1941 76.5431 0.0179 3.4966 66.5054 2.1809 1.6846 95.6276 137.1045 34.0891 241.8726 11.7411 20.4821 221.9537 106.3945 104.4082 0.5513 17.1466 1.7235 45.4810 22.0581 10.4373 7.5248 9.3595 28.5956 197.5005 3.6074 13.4194 15.5974 3.2292 0.2787 170.1750 37.4308 7.8942 21.3645 1.6892 0.0888 74.2494 47.6755 2.3410 2.9591 2.5938 5.6241
temp: 298.150 k
press: 1.00000 atm
elementType: 35 8 8 6 6 6 6 6 6 6 6 6 6 1 1 1 1 1 1 1 1 1 1 1
symmnumber: 1
zpe: 484366.0 jmol-1
zpe.correction: 0.184485 hartree
zpe.thermalcorrener: 0.198024 hartree
zpe.thermalcorrenthalpy: 0.198968 hartree
zpe.thermalcorrgfe: 0.140408 hartree
zpe.sumelectzpe: -550.611536 hartree
zpe.sumelectthermal: -550.597997 hartree
zpe.sumelectthermalent: -550.597053 hartree
zpe.sumelectthermalfe: -550.655613 hartree
dipole: -2.5050 1.8087 0.0104
dipole: 3.0898
quadrupole: -80.4671 -83.3378 -88.0895
quadrupole: -4.3052 -0.0585 0.0998
quadrupole: 3.4977 0.6270 -4.1247 -4.3052 -0.0585 0.0998
hfenergy: -550.7960216 hartree
pointgroup: C01 [X(C10H11Br1O2)]
dipole: -0.9994589 -0.5707011 0.3912621 debye
dipolederiv: -0.8007043 -0.0379684 0.0132078 -0.0562098 -0.058692 0.0151002 0.0265292 0.0154826 -0.0468048 -2.4259339 0.2754995 -0.2409111 0.5254935 -0.4171191 0.1829384 -0.432145 0.1775366 -0.3214015 -0.7427492 -0.0903323 0.0607453 0.4365588 -0.6789341 0.3011299 -0.3363772 0.2887886 -0.4956275 0.1049182 -0.0118659 0.007175 -0.0914286 0.0935422 0.0348431 0.0668274 0.0397137 0.1245209 -0.3329794 -0.074362 0.0414739 -0.2365848 -0.0272603 0.0987169 0.110534 0.0940869 0.069061 -0.0760457 -0.0237872 0.016281 0.0254567 0.069887 0.0201225 -0.012127 0.0190892 0.0936383 2.1933721 -0.0959155 0.1175066 -0.8977974 0.8953231 -0.528572 0.7422334 -0.5084923 0.5801454 1.4529043 -0.0582524 0.0661439 0.1589826 0.0825609 0.0140884 -0.09631 0.0104536 0.0870767 -0.2448624 -0.0101786 0.005594 -0.0346094 -0.1002677 -0.0310324 0.022472 -0.0307436 -0.1199151 -0.2227979 0.0429389 -0.0321385 0.0304773 -0.0474366 -0.0844499 -0.0221811 -0.0845492 -0.105231 -0.3640467 0.0416908 -0.0353369 0.0071242 0.0200361 -0.0787994 -0.0094723 -0.0789164 -0.0338908 -0.3024257 -0.0842965 0.0566646 -0.0534394 -0.0012782 -0.0665007 0.0342413 -0.0668441 -0.0433191 1.3304123 0.0940509 -0.0407153 0.0900055 -0.0538369 -0.057848 -0.0378874 -0.0575337 -0.0955358 0.049874 -0.0058526 0.0340488 0.0187433 0.0751627 0.0244547 0.0091382 0.0363629 -0.1423099 0.0375118 -0.0357285 -0.0126483 -0.0021942 -0.1250648 -0.0729884 -0.0220009 -0.0861913 0.0468479 0.0242985 0.0002071 0.0012086 0.0458984 -0.0634609 -0.0587913 -0.0093572 -0.075663 0.0796427 0.0310502 0.0035763 -0.0096575 0.0433838 0.1048037 0.0157743 -0.0360701 0.0345554 -0.0863427 0.0793781 0.0003511 0.014327 -0.0701159 -0.1412717 -0.0927229 -0.0002884 -0.10184 0.0434368 0.0793402 -0.0111468 -0.0127773 -0.034289 0.0826314 0.0250286 0.0568513 0.0333701 -0.1794402 -0.1523073 0.0890279 -0.0488189 0.1266499 0.0185732 0.0477641 -0.0711943 0.0483576 0.0763591 0.1436735 0.0363574 -0.0266825 0.0190905 0.1108734 0.0522037 -0.0134884 0.0529754 0.1451606 0.0501312 -0.0587875 0.0401288 -0.0551317 0.0585758 0.0823098 0.0375362 0.0824501 0.1160252 0.0523657 -0.0461588 0.0312402 -0.053384 0.0439683 0.0815023 0.0362971 0.0817375 0.1007271 0.0356223 0.0609329 -0.0460592 0.0573194 0.0586846 0.0757281 -0.0437607 0.0758136 0.1071767 unknown
polarizability: 221.3309717|-0.0871922|98.0585511|2.8276531|-25.0930733|81.0341281 unknown
InChI: InChI=1S/C10H11BrO2/c1-2-3-10(12)13-9-6-4-8(11)5-7-9/h4-7H,2-3H2,1H3
charge 0 multiplicity 1
24 atoms
Br 5.390549 0.148412 0.017824
O  -0.753294 -0.464452 0.350887
O  -1.593435 1.302703 -0.964882
C  -4.325286 0.55143 -0.324674
C  -3.124903 -0.290135 0.152781
C  -5.669467 -0.09382 0.070955
C  -1.785198 0.305931 -0.240858
C  0.644458 -0.222875 0.197982
C  1.227989 0.829144 -0.547685
C  1.448272 -1.160183 0.88664
C  2.63828 0.929888 -0.594293
C  2.852882 -1.056156 0.837073
C  3.43419 -0.006563 0.093375
H  -4.269365 0.676772 -1.421849
H  -4.25124 1.568908 0.10311
H  -3.175126 -1.316079 -0.264812
H  -3.13702 -0.41844 1.252379
H  -5.779314 -1.100292 -0.37546
H  -5.757062 -0.201431 1.168645
H  -6.519527 0.521102 -0.274923
H  0.606155 1.550644 -1.077565
H  0.964792 -1.960513 1.454104
H  3.10144 1.738355 -1.166983
H  3.478129 -1.778949 1.368129
