program: Gaussian 09
title: 000096081
version: EM64L-G09RevD.01
frameworkgroup: C1[X(C12H11NS)]
method: RPBEPBE
basis: SDD
operation: Freq
keyword: #p
keyword: freq=noraman
keyword: PBEPBE/SDD
title: #p freq=noraman PBEPBE/SDD
converged: YES YES NO NO
title: Mulliken charges:
elementType: S N C C C C C C C C C C C C H H H H H H H H H H H
charge: 0.213570 -0.694923 -0.280968 -0.165156 -0.197285 -0.184274 0.495307 -0.397702 -0.398220 -0.172302 -0.256391 -0.240361 -0.212271 -0.243620 0.253304 0.253778 0.220456 0.220434 0.255859 0.238304 0.223937 0.225590 0.226477 0.308199 0.308257
chargesum: 0.00000
title: Mulliken charges with hydrogens summed into heavy atoms:
elementType: S N C C C C C C C C C C C C
charge: 0.213570 -0.078467 -0.280968 -0.165156 0.056019 0.069503 0.495307 -0.177246 -0.177786 0.083557 -0.018087 -0.016424 0.013319 -0.017144
polarizability: 2.34769397e+02 -1.36788412e+01 1.29330897e+02 3.67904611e+00 3.66626068e-01 1.01953928e+02
1716.lowfreq: -10.4357 -0.0018 -0.0005 0.0022 5.3502 10.5271 16.3393 35.5362 47.7368
frequency: 13.8217 35.4988 47.7321 140.8535 170.7600 236.9092 238.9873 304.1953 379.3448 384.7900 387.7432 400.0973 402.4016 413.1073 429.1349 468.9543 521.4127 609.7179 627.1566 632.1205 667.7395 694.0174 715.3825 743.8827 814.6225 814.9247 826.6699 841.2960 904.3342 944.1704 957.4317 969.8591 982.8104 987.6755 990.0655 1015.7635 1016.9934 1061.6662 1078.7729 1083.4884 1122.1315 1169.8532 1182.8228 1186.3422 1291.9022 1305.9366 1314.7350 1375.3622 1377.2471 1425.3048 1427.3440 1460.3791 1492.8405 1571.9700 1585.1316 1591.8286 1618.7222 1644.4016 3121.7797 3122.6095 3124.9827 3128.5773 3141.7042 3152.3420 3154.1203 3159.0069 3164.5513 3566.1769 3705.8967
redmass: 4.2862 3.6508 5.4601 5.0286 4.6249 5.7571 5.3721 5.2926 1.2458 2.7827 1.0539 7.6411 3.3113 2.7555 8.3429 3.2108 2.5960 6.4371 6.7400 6.9345 6.8331 2.2587 3.2893 1.4936 1.3086 4.5170 1.8002 1.2501 1.3760 1.3424 1.3567 1.3736 6.3395 1.3055 3.9437 1.4488 3.3738 2.4403 1.5909 2.8093 1.2202 1.0496 1.1060 1.1187 1.3260 1.3244 2.7585 4.9375 7.2487 3.6138 2.2262 2.0386 2.9852 7.0099 6.2832 5.9500 4.3309 1.2631 1.0844 1.0889 1.0886 1.0878 1.0929 1.0951 1.0954 1.0966 1.1013 1.0450 1.1040
irintensity: 0.6821 0.0519 1.3081 2.5912 0.2891 0.6622 0.8626 1.0582 298.7250 2.3047 18.7691 0.5350 0.0759 0.1878 5.0343 11.2551 24.2578 1.1327 2.5099 0.0985 15.1819 28.2283 0.2844 78.7432 0.2630 0.9769 82.8731 0.2284 1.5355 0.2344 0.0311 0.1569 3.6447 0.0515 4.8410 0.1426 29.9621 11.1436 4.7229 5.4123 16.3622 0.2484 39.4535 0.5115 2.1124 1.6235 73.9544 4.4100 2.7928 0.0949 8.3081 63.4410 114.9349 4.1270 0.4415 63.2188 99.3730 264.0149 2.2457 11.2289 27.9359 3.6400 20.9260 21.4334 16.5451 3.0074 28.8680 88.1999 22.1592
temp: 298.150 k
press: 1.00000 atm
elementType: 16 7 6 6 6 6 6 6 6 6 6 6 6 6 1 1 1 1 1 1 1 1 1 1 1
symmnumber: 1
zpe: 512254.8 jmol-1
zpe.correction: 0.195108 hartree
zpe.thermalcorrener: 0.207669 hartree
zpe.thermalcorrenthalpy: 0.208613 hartree
zpe.thermalcorrgfe: 0.154007 hartree
zpe.sumelectzpe: -915.708620 hartree
zpe.sumelectthermal: -915.696059 hartree
zpe.sumelectthermalent: -915.695114 hartree
zpe.sumelectthermalfe: -915.749721 hartree
dipole: -3.6120 2.5611 0.0339
dipole: 4.4280
quadrupole: -62.0583 -89.3501 -86.4394
quadrupole: -8.4901 0.9633 0.3819
quadrupole: 17.2243 -10.0675 -7.1568 -8.4901 0.9633 0.3819
hfenergy: -915.9037279 hartree
pointgroup: C01 [X(C12H11N1S1)]
dipole: -1.3535655 -0.9750206 0.5021855 debye
dipolederiv: -0.2776028 0.1863069 -0.0940483 0.376554 -0.044523 -0.0298865 -0.1488479 -0.0404891 -0.0878583 -1.5464495 -0.3101979 0.1069282 -0.4636028 -0.6993417 0.3715057 0.1916554 0.3752247 -0.3283595 0.1636718 0.0859873 -0.035477 0.0851167 -0.2355584 0.0056641 -0.0580691 0.0119653 -0.2209388 0.678379 -0.4410562 0.2526701 -0.6475386 0.137259 -0.1222533 0.326493 -0.1175002 0.0270086 0.1102726 0.0555215 -0.1328684 -0.0096663 -0.0031545 0.03785 -0.2097015 0.0572637 0.1169249 0.0760474 0.1383245 -0.0022949 0.1491498 0.0791319 0.1034216 0.1090125 0.0845298 0.0534388 1.4662094 0.5726141 -0.2786516 0.7068674 0.4140664 -0.2173196 -0.3446927 -0.218888 0.1330316 -0.4450383 -0.040861 0.029507 -0.322479 -0.2535911 0.192104 -0.2764896 -0.0048734 0.0198746 -0.4775113 -0.0901796 -0.0067151 0.0859935 -0.0879301 0.0782577 0.341097 0.275806 -0.1048285 -0.241292 0.1104368 -0.0744813 0.2894342 -0.2090752 0.0571195 -0.166379 0.0530725 -0.1446001 -0.4073254 0.1512793 -0.0968257 0.2187229 -0.0163042 -0.0836939 -0.1412352 -0.0864884 -0.086139 0.1414787 -0.010231 -0.005971 -0.0208178 0.0521918 -0.1293693 -0.0010499 -0.1281624 -0.0601231 0.130977 -0.0028275 -0.0167709 -0.0443662 0.0197121 -0.1111404 0.0188632 -0.1092459 -0.075451 -0.1116411 -0.0738423 0.0390651 -0.0335254 -0.1082748 -0.0491491 0.0186593 -0.0496628 -0.1603374 0.1197322 -0.0757461 -0.0354899 -0.0645067 0.0382459 -0.0799718 -0.0396269 -0.0684124 0.045277 0.0984856 0.0061465 0.0964379 0.0150168 0.0984414 -0.0350326 0.0899996 -0.0468113 0.0015885 -0.0097101 -0.0124549 0.1248547 -0.0314958 0.110805 -0.0558446 0.1352014 -0.0680423 -0.0377283 0.0117704 -0.1081657 -0.0318714 -0.1252794 0.0151518 -0.1172704 -0.0227978 -0.1031733 0.0360349 0.0179163 -0.0410906 0.0416844 -0.0937257 0.0800468 0.0230834 0.0771475 0.0265457 0.1043395 0.1180834 0.0046557 0.0025462 -0.0383253 -0.0124568 0.114361 0.0244976 0.1126456 0.0815355 0.058193 -0.0297648 0.0233574 0.0074616 -0.0426812 0.1302639 -0.0032755 0.1293616 0.0659577 -0.1469772 -0.05096 0.0467485 -0.0445514 0.0909893 0.0468236 0.046637 0.0457304 0.1240315 -0.0644874 0.0947672 -0.0518226 0.1085343 0.0431945 0.0763501 -0.0583804 0.0755421 0.1201955 0.2715792 -0.0642734 0.0408474 -0.0734555 0.2560247 -0.1046947 0.0109438 -0.1123802 0.1969339 0.2652388 -0.0543888 0.0586414 -0.0295153 0.2776304 -0.1011782 0.0803384 -0.0935575 0.1801915 unknown
polarizability: 232.6531391|16.6539507|124.9801982|-11.8405063|-12.279871|108.4208851 unknown
InChI: InChI=1S/C12H11NS/c13-10-6-8-12(9-7-10)14-11-4-2-1-3-5-11/h1-9H,13H2
charge 0 multiplicity 1
25 atoms
S  0.499651 1.638362 -1.009089
N  -4.657587 -1.227233 0.471303
C  -1.026744 0.730944 -0.534335
C  1.848955 0.541218 -0.375049
C  -1.717064 1.069443 0.654042
C  -1.563094 -0.264396 -1.386419
C  -3.46551 -0.584571 0.141255
C  -2.921763 0.42325 0.992311
C  -2.764314 -0.919689 -1.056025
C  1.607525 -0.617633 0.397261
C  3.177136 0.920012 -0.694568
C  2.698485 -1.395807 0.848955
C  4.259564 0.136979 -0.236462
C  4.026762 -1.024958 0.537227
H  -1.307078 1.84152 1.313475
H  -1.035132 -0.52448 -2.309843
H  -3.445796 0.698292 1.915638
H  -3.167014 -1.689198 -1.72587
H  0.581492 -0.910668 0.642326
H  3.363979 1.816178 -1.29751
H  2.50482 -2.2935 1.447463
H  5.283611 0.435882 -0.487874
H  4.867968 -1.631334 0.890334
H  -5.162427 -0.986376 1.319023
H  -5.050324 -1.941536 -0.134571
