program: Gaussian 09
title: 000096075
version: EM64L-G09RevD.01
frameworkgroup: C1[X(C6H5Cl2N3)]
method: RPBEPBE
basis: SDD
operation: Freq
keyword: #p
keyword: freq=noraman
keyword: PBEPBE/SDD
title: #p freq=noraman PBEPBE/SDD
converged: YES YES NO NO
title: Mulliken charges:
elementType: Cl Cl N N N C C C C C C H H H H H
charge: -0.007477 -0.007603 -0.061666 0.038914 0.039668 -0.392888 -0.392681 -0.095766 -0.148442 -0.148500 -0.118600 0.252259 0.252930 0.252932 0.252094 0.284825
chargesum: 0.00000
title: Mulliken charges with hydrogens summed into heavy atoms:
elementType: Cl Cl N N N C C C C C C
charge: -0.007477 -0.007603 -0.061666 0.038914 0.039668 0.112301 0.112345 -0.095766 -0.148442 -0.148500 0.166225
polarizability: 1.49765130e+02 -2.38215702e-02 1.30724982e+02 -4.07569914e+00 -1.94128207e-03 4.68463206e+01
1716.lowfreq: -9.4032 -1.4717 -0.8500 0.0022 0.0022 0.0023 74.3721 97.0152 133.8802
frequency: 74.3609 97.0149 133.8802 142.3537 181.7728 202.3400 233.9630 311.5667 356.7330 395.3515 454.8375 556.8877 575.8559 631.2860 745.4557 764.3781 764.8476 791.6796 823.4021 896.7777 941.6085 959.0879 1001.1726 1082.0077 1100.3997 1113.5733 1122.1348 1138.1675 1189.8424 1241.2923 1251.9089 1334.0275 1456.8572 1462.9618 1477.8372 1534.6918 1547.5214 3082.5028 3089.9164 3187.8983 3203.2748 3221.4160
redmass: 3.4730 5.2139 5.9417 3.0487 16.6606 10.8814 5.1728 6.0422 17.3783 11.7770 6.7506 6.0433 12.3908 5.0323 7.0834 6.6450 12.7768 1.0480 1.4460 6.5688 6.0838 4.7801 1.0998 1.6975 1.3073 1.3297 1.4376 1.4615 6.4661 5.7899 5.3621 3.9583 6.3450 1.0840 1.1859 9.9104 10.4729 1.0487 1.0608 1.1189 1.1176 1.0961
irintensity: 2.8977 9.5990 6.5423 0.0400 1.7843 0.0055 20.4565 0.8854 5.2791 11.0592 5.2818 0.5546 0.0017 12.8243 22.7716 0.4188 121.0768 36.2856 32.8074 8.2624 12.4751 84.1476 1.8751 28.0614 5.4773 4.1154 57.5159 5.5936 78.2694 89.7776 0.3407 20.8160 403.3755 18.7960 7.7703 65.0411 1240.2357 12.8661 40.0274 0.6539 21.8451 5.3177
temp: 298.150 k
press: 1.00000 atm
elementType: 17 17 7 7 7 6 6 6 6 6 6 1 1 1 1 1
symmnumber: 1
zpe: 274392.5 jmol-1
zpe.correction: 0.104511 hartree
zpe.thermalcorrener: 0.114497 hartree
zpe.thermalcorrenthalpy: 0.115441 hartree
zpe.thermalcorrgfe: 0.067634 hartree
zpe.sumelectzpe: -1315.158397 hartree
zpe.sumelectthermal: -1315.148411 hartree
zpe.sumelectthermalent: -1315.147466 hartree
zpe.sumelectthermalfe: -1315.195273 hartree
dipole: 2.5113 -0.0014 1.2777
dipole: 2.8176
quadrupole: -61.4875 -86.2644 -77.2607
quadrupole: -0.0828 2.4344 -0.0213
quadrupole: 13.5167 -11.2602 -2.2565 -0.0828 2.4344 -0.0213
hfenergy: -1315.2629072 hartree
pointgroup: C01 [X(C6H5Cl2N3)]
dipole: 1.0066343 -0.0649461 0.4597258 debye
dipolederiv: -0.4870117 0.3194226 0.2305973 0.3752816 -0.4578727 -0.2634503 0.2864476 -0.2707112 -0.2654603 -0.2404309 -0.2339694 -0.1056747 -0.3080884 -0.7485419 -0.3181753 -0.1280388 -0.3044896 -0.2217173 -2.0846535 -0.3080088 -0.1401975 -0.5916489 -0.2660885 0.1416345 0.3619853 0.2381586 -0.3724185 -1.600728 0.004915 0.1756542 0.225293 -0.3678235 -0.1449248 0.3885135 -0.1139971 -0.2763351 -1.3342179 -0.4046935 -0.0824739 -0.7020757 -0.6667877 -0.1844825 -0.1561457 -0.1887387 -0.2445467 0.5217775 -0.0242872 -0.0467788 -0.0296523 0.0865543 -0.0812515 -0.0974891 -0.1166926 0.2247675 0.4319 0.1667542 0.0726049 0.2165742 0.1803265 -0.0877184 0.0448483 -0.0671635 0.218789 2.4054445 0.4047271 -0.0656709 0.6060263 0.5452008 0.1205026 -0.4234518 0.0518362 0.2649273 1.5030426 -0.1685332 -0.3241458 -0.3120491 1.0194849 0.5830924 -0.4535468 0.568953 0.4256919 1.2442139 0.3158396 -0.0193801 0.5004797 1.340592 0.6131906 0.0358509 0.6128977 0.3635834 -0.4845981 0.0702242 0.0904315 0.0620254 -0.8643597 -0.4299483 0.104665 -0.4270494 -0.3359301 -0.0045079 0.0278498 0.0748383 0.0821921 0.0710799 0.0056545 0.1454393 -0.0056915 0.0087906 0.004671 -0.0273087 0.0528388 0.0597583 -0.036301 0.0746044 -0.0577488 0.0655648 0.0542487 0.017462 -0.0506136 0.065769 -0.0034432 0.0818355 0.0062338 -0.0617036 -0.0303887 -0.0764898 0.0647083 -0.0709394 0.0080095 -0.1567199 -0.0454878 -0.0021504 -0.0074856 0.0194725 0.0558013 0.0429282 -0.0213787 0.0135781 -0.023953 0.1281886 -0.0328112 0.0178604 -0.0319605 0.1762981 unknown
polarizability: 148.1764918|8.0761786|112.4457994|-8.2088689|34.8574887|66.7141412 unknown
InChI: InChI=1S/C6H5Cl2N3/c7-4-3-5(8)10-6(9-4)11-1-2-11/h3H,1-2H2
charge 0 multiplicity 1
16 atoms
Cl -2.601774 1.846793 1.310104
Cl -1.692132 -2.916836 -1.402573
N  1.944233 0.450754 -0.402765
N  -0.194415 0.999246 0.415335
N  0.206048 -1.093751 -0.776716
C  3.164195 -0.342664 -0.170626
C  2.907606 0.982675 0.577005
C  0.624907 0.100622 -0.232297
C  -1.493246 0.680736 0.460672
C  -1.105041 -1.346998 -0.693984
C  -2.056787 -0.493228 -0.089742
H  3.881101 -0.368414 -0.99643
H  3.053444 -1.28001 0.386888
H  2.625239 0.932346 1.635227
H  3.44493 1.887296 0.277713
H  -3.119609 -0.724564 -0.041812
