program: Gaussian 09
title: 000096074
version: EM64L-G09RevD.01
frameworkgroup: C1[X(C12H9ClN4S)]
method: RPBEPBE
basis: SDD
operation: Freq
keyword: #p
keyword: freq=noraman
keyword: PBEPBE/SDD
title: #p freq=noraman PBEPBE/SDD
converged: NO NO NO NO
title: Mulliken charges:
elementType: Cl S N N N N C C C C C C C C C C C C H H H H H H H H H
charge: -0.059080 0.203890 -0.397270 -0.022310 0.004693 0.044798 0.324897 -0.783840 0.492080 -0.335741 -0.075506 -0.351159 -0.385306 -0.213515 -0.079799 -0.199507 -0.232292 -0.393356 0.298891 0.300076 0.330240 0.266468 0.245372 0.268677 0.236580 0.260593 0.251425
chargesum: 0.00000
title: Mulliken charges with hydrogens summed into heavy atoms:
elementType: Cl S N N N N C C C C C C C C C C C C
charge: -0.059080 0.203890 -0.067031 -0.022310 0.004693 0.044798 0.324897 -0.184874 0.492080 -0.335741 -0.075506 -0.084692 -0.139933 0.055162 -0.079799 0.037073 0.028301 -0.141930
polarizability: 2.94305001e+02 3.15669254e+00 1.50625051e+02 8.12487894e+00 6.06021534e+00 1.32174401e+02
1716.lowfreq: -0.0020 0.0021 0.0021 5.2886 5.9389 13.5959 15.3708 25.1451 43.7802
frequency: 14.7141 23.7389 43.6703 50.5681 112.0893 128.2027 165.0195 186.0281 218.6228 224.8153 258.7946 279.4017 361.4705 388.3519 400.2441 435.3176 487.4745 517.1340 539.0347 556.5715 577.6787 602.0584 618.7702 649.1242 649.8211 658.7604 668.7801 707.6153 793.2617 794.8644 797.2921 843.3392 848.5610 890.6469 898.4393 901.7497 912.9750 921.3102 924.0778 981.8759 984.4964 1071.6473 1073.0577 1084.0006 1114.8587 1121.7022 1163.3346 1178.8666 1216.4416 1231.3004 1247.3835 1263.8215 1293.8680 1296.8559 1334.4573 1346.2000 1378.5432 1402.5649 1421.1625 1430.5019 1445.5511 1465.3148 1484.1721 1575.4457 1576.9290 1605.8136 3055.1055 3130.8514 3135.0878 3152.5052 3155.0338 3169.1723 3174.9604 3235.3711 3579.7126
redmass: 8.9829 7.1526 7.3708 6.3276 7.3208 8.5017 6.5996 5.1417 4.9164 5.4570 5.7748 5.6069 3.0382 8.9176 12.5457 3.1751 6.2171 5.8476 5.2200 7.2915 8.8450 4.5530 1.4696 2.8049 7.9304 5.3360 6.7866 2.2247 7.4061 8.4250 1.5449 1.5143 3.9247 1.5605 1.5713 7.8043 1.4406 6.7521 1.4305 1.3590 5.7227 2.0660 2.1554 1.4824 5.1215 1.0885 4.0344 1.0877 2.1221 2.2991 1.5443 4.7869 1.3270 4.5975 2.9930 2.4863 9.0646 1.6902 2.6385 3.3317 1.1128 2.5005 9.1286 8.0206 6.5067 6.7570 1.0581 1.1079 1.0883 1.0931 1.0936 1.0922 1.0981 1.0991 1.0824
irintensity: 1.1399 2.4561 1.0603 0.5322 4.3691 10.4383 0.5540 0.2291 0.8825 0.2314 1.2631 7.2539 2.7409 4.3610 3.3540 4.3067 12.3426 4.4190 0.2581 7.7123 39.1475 40.8371 75.8046 9.6119 10.5564 0.9386 31.1359 45.5593 0.2079 34.3399 34.1445 16.3105 21.3561 11.4285 13.3608 4.1923 3.7103 67.5464 13.4174 0.3720 2.6428 15.5881 22.9038 3.6167 4.5536 0.7412 16.9476 0.2152 15.8808 80.0489 18.8917 50.2580 0.8562 66.2372 204.6474 13.8607 0.1250 7.2760 23.4644 59.3942 7.3842 32.5406 206.8024 75.0674 42.4290 21.2664 3.8875 1.7004 5.7090 6.8391 5.4127 16.4344 6.7561 0.8369 53.0213
temp: 298.150 k
press: 1.00000 atm
elementType: 17 16 7 7 7 7 6 6 6 6 6 6 6 6 6 6 6 6 1 1 1 1 1 1 1 1 1
symmnumber: 1
zpe: 500208.7 jmol-1
zpe.correction: 0.190519 hartree
zpe.thermalcorrener: 0.205692 hartree
zpe.thermalcorrenthalpy: 0.206636 hartree
zpe.thermalcorrgfe: 0.144453 hartree
zpe.sumelectzpe: -1538.546584 hartree
zpe.sumelectthermal: -1538.531412 hartree
zpe.sumelectthermalent: -1538.530468 hartree
zpe.sumelectthermalfe: -1538.592651 hartree
dipole: 3.1456 2.0083 3.4593
dipole: 5.0887
quadrupole: -151.3567 -108.9958 -113.2804
quadrupole: -18.8889 -2.0990 2.4451
quadrupole: -26.8124 15.5485 11.2639 -18.8889 -2.0990 2.4451
hfenergy: -1538.7371038 hartree
pointgroup: C01 [X(C12H9Cl1N4S1)]
dipole: 1.2704916 1.2108804 0.9632632 debye
polarizability: 294.2151118|8.6199571|152.7204614|-2.9663129|-1.1416945|130.1688795 unknown
InChI: InChI=1S/C12H9ClN4S/c13-9-3-1-2-8(4-9)5-18-12-10-11(15-6-14-10)16-7-17-12/h1-4,6-7,14H,5H2
charge 0 multiplicity 1
27 atoms
Cl 5.642397 0.944392 -2.115743
S  -0.013034 0.601061 0.230338
N  -3.159788 1.894835 0.254994
N  -5.150395 0.788269 -0.027426
N  -1.716658 -1.540752 -0.206999
N  -4.169917 -1.480278 -0.330904
C  -2.828007 0.551429 0.062413
C  1.140608 -0.915926 0.029068
C  2.569165 -0.469702 0.227853
C  -1.633423 -0.202795 0.009752
C  -4.084587 -0.131411 -0.1136
C  3.334828 -0.024739 -0.881675
C  3.164857 -0.493336 1.516165
C  -4.55809 1.973835 0.190858
C  4.667087 0.378527 -0.679685
C  4.504793 -0.084064 1.692664
C  5.274166 0.357964 0.591362
C  -2.965595 -2.105926 -0.364706
H  0.945383 -1.319455 -0.975556
H  0.809716 -1.653358 0.775445
H  -2.513161 2.66819 0.410063
H  2.894206 0.004318 -1.883688
H  2.576647 -0.83388 2.375846
H  -5.090389 2.915848 0.309145
H  4.961009 -0.109114 2.688039
H  6.31385 0.674381 0.716243
H  -2.975868 -3.186016 -0.53687
