program: Gaussian 09
title: 000010671
version: EM64L-G09RevD.01
frameworkgroup: C1[X(C13H11N)]
method: RPBEPBE
basis: SDD
operation: Freq
keyword: #pfreq=noraman
keyword: PBEPBE/SDD
title: #p freq=noraman PBEPBE/SDD
converged: YES YES NO NO
title: Mulliken charges:
elementType: N C C C C C C C C C C C C C H H H H H H H H H H H
charge: -0.615081 -0.478359 0.380503 0.380515 0.142194 0.142201 -0.428932 -0.428934 -0.392939 -0.392939 -0.242813 -0.242811 -0.232526 -0.232527 0.224147 0.236275 0.236275 0.238710 0.238709 0.283474 0.283476 0.224985 0.224984 0.225708 0.225708
chargesum: 0.00000
title: Mulliken charges with hydrogens summed into heavy atoms:
elementType: N C C C C C C C C C C C C C
charge: -0.048132 -0.254213 0.380503 0.380515 0.142194 0.142201 -0.192657 -0.192659 -0.154229 -0.154230 -0.017828 -0.017827 -0.006818 -0.006819
polarizability: 2.17809069e+02 -1.10228453e-04 1.51242934e+02 4.64010143e-05 -7.47935357e+00 6.46056430e+01
1716.lowfreq: -14.2798 -9.2757 -0.0003 0.0003 0.0003 2.2293 35.7074 72.7087 122.2243
frequency: 35.2413 72.7079 122.2237 129.9572 205.2429 213.8254 311.5668 361.6751 407.8107 421.7073 446.1261 504.5760 507.7594 550.6385 562.4556 579.4033 618.2617 656.5801 721.9513 746.2236 747.4382 764.3081 786.7997 804.9185 838.7780 876.7188 882.4668 945.2178 945.6376 983.3040 985.1943 996.4353 1020.9631 1027.5520 1050.7115 1097.9012 1107.6947 1121.1141 1169.0556 1170.8803 1185.8448 1196.8218 1243.2964 1243.8528 1285.2824 1304.0596 1316.6698 1381.0106 1403.5940 1440.2161 1445.1909 1469.1527 1485.6623 1594.1067 1595.1025 1620.5598 1620.8408 1631.1849 2837.7668 3115.5173 3116.1076 3125.0656 3126.8354 3139.9714 3141.3289 3160.1670 3160.9621 3462.7000 3595.8289
redmass: 1.0457 3.7998 4.5360 3.7068 4.3601 3.7332 3.7592 3.8889 6.0150 3.1076 3.0233 1.7081 4.9868 2.7429 3.5813 3.8132 6.8650 4.0998 4.9127 1.7374 1.6721 2.7281 2.1309 3.2509 2.8188 1.4870 1.6083 1.4319 1.4466 1.3326 1.3209 6.5646 2.3401 2.1187 4.1202 1.6815 1.9364 1.3118 1.1134 1.0777 1.4806 2.0794 1.6039 1.8013 1.5734 1.9363 1.7099 7.4249 3.8041 2.2245 2.7193 2.7038 4.2313 6.4378 7.1327 4.3359 7.3879 1.2156 1.0797 1.0873 1.0874 1.0881 1.0881 1.0939 1.0940 1.1002 1.1001 1.0443 1.0986
irintensity: 37.7366 0.3851 7.7603 0.4355 0.4588 3.0120 1.7324 6.1365 1.7655 0.5676 0.2337 113.5939 0.7195 65.6368 0.0028 0.0534 7.9731 40.0186 0.6680 0.0271 145.8173 43.2826 0.1375 0.8171 1.0733 0.0140 0.5507 0.0271 3.8816 0.0051 0.0156 4.4200 1.4714 9.4101 9.3094 0.1639 3.7071 1.3753 0.5929 0.1218 0.2677 8.0837 0.1323 2.0562 29.6114 2.4397 0.7345 10.6610 0.5588 30.1052 7.3883 7.5213 0.1649 0.2049 0.2762 9.2584 5.5717 45.5689 74.0044 2.0050 17.1998 4.5789 2.6624 8.5448 46.8873 66.8159 8.4050 2.2046 0.8177
temp: 298.150 k
press: 1.00000 atm
elementType: 7 6 6 6 6 6 6 6 6 6 6 6 6 6 1 1 1 1 1 1 1 1 1 1 1
symmnumber: 1
zpe: 526020.3 jmol-1
zpe.correction: 0.200351 hartree
zpe.thermalcorrener: 0.211469 hartree
zpe.thermalcorrenthalpy: 0.212413 hartree
zpe.thermalcorrgfe: 0.162743 hartree
zpe.sumelectzpe: -555.778546 hartree
zpe.sumelectthermal: -555.767428 hartree
zpe.sumelectthermalent: -555.766483 hartree
zpe.sumelectthermalfe: -555.816154 hartree
dipole: 0.0001 1.0377 -0.8984
dipole: 1.3726
quadrupole: -70.0999 -65.7828 -89.7655
quadrupole: 0.0001 0.0001 -3.1715
quadrupole: 5.1162 9.4332 -14.5494 0.0001 0.0001 -3.1715
hfenergy: -555.9788965 hartree
pointgroup: C01 [X(C13H11N1)]
dipole: 0.0000236 0.4049647 -0.3572572 debye
dipolederiv: -0.2707693 -0.0000113 0.0000195 -0.0000134 -0.4981614 -0.023158 0.0000097 -0.0633516 -0.7466381 0.2075324 0.0000166 -0.0000004 0.0000115 0.4232122 0.1644037 -0.0000042 0.1190924 0.5672721 -0.1493378 -0.0722589 0.0117322 -0.2223836 0.0099997 -0.0268313 0.0122515 -0.028389 -0.064638 -0.1493388 0.072255 -0.0117337 0.2223759 0.0100009 -0.0268316 -0.012247 -0.0283778 -0.0646365 0.2651155 -0.0843489 0.0106944 0.0828967 -0.0597342 0.0106961 -0.0171532 0.0051772 0.0078735 0.2650985 0.0843529 -0.0106951 -0.082895 -0.0597345 0.0106961 0.0171543 0.0051724 0.0078721 0.0606094 0.1055606 -0.0138114 0.106455 0.0820243 -0.0442912 -0.01677 -0.024882 -0.1527405 0.0606095 -0.1055644 0.0138128 -0.1064556 0.0820253 -0.0442909 0.0167698 -0.0248812 -0.1527405 -0.0858703 0.0649059 -0.0046082 0.0409207 0.0723222 -0.0308227 -0.0010973 -0.0359836 -0.1472585 -0.0858626 -0.0649087 0.0046093 -0.0409178 0.0723212 -0.0308236 0.0010964 -0.0359837 -0.1472577 -0.0450088 0.006964 0.0001625 0.1287884 -0.0272546 -0.0195962 -0.0130653 -0.0244342 -0.1676074 -0.045004 -0.0069634 -0.0001628 -0.12879 -0.0272544 -0.0195959 0.0130657 -0.0244342 -0.167606 -0.0242863 -0.0818387 0.0103284 -0.1936655 0.0221658 -0.0289318 0.0309901 -0.0248177 -0.153024 -0.0242926 0.081839 -0.0103284 0.1936665 0.0221663 -0.028932 -0.03099 -0.0248175 -0.1530247 -0.029792 -0.0000016 0.0000001 -0.0000004 -0.074196 0.0710562 0.000001 -0.0137773 -0.244288 0.0638878 -0.0369645 0.004077 -0.0912314 -0.1100484 0.03983 0.0057828 0.0368115 0.1411784 0.063887 0.0369648 -0.0040771 0.0912335 -0.1100481 0.0398307 -0.0057833 0.0368117 0.1411782 0.0710435 -0.0834 0.0119849 -0.0425587 -0.0809501 0.0321303 0.0032277 0.0334517 0.1484069 0.0710424 0.0834021 -0.0119854 0.04256 -0.0809493 0.0321309 -0.0032279 0.0334524 0.1484066 0.0748536 0.119673 -0.0438707 0.1059413 0.1170031 -0.0765346 -0.0779024 0.0029535 0.284914 0.0748376 -0.1196715 0.0438522 -0.1059358 0.1170158 -0.0765397 0.0778922 0.0029514 0.2849211 -0.1451516 -0.0328614 0.0060746 -0.0392868 0.0808091 0.0110379 0.0049031 0.0112774 0.1602248 -0.1451539 0.0328596 -0.0060747 0.0392841 0.0808099 0.0110378 -0.004903 0.0112774 0.1602243 -0.0393251 0.1066641 -0.0153936 0.1260919 -0.0317717 0.0271647 -0.0194338 0.0278503 0.154494 -0.0393242 -0.1066645 0.0153935 -0.1260915 -0.031773 0.0271651 0.0194332 0.0278503 0.1544939 unknown
polarizability: 217.8090688|0.0001804|151.0959965|0.0001078|-8.2854948|64.7525807 unknown
InChI: InChI=1S/C13H11N/c14-13-11-7-3-1-5-9(11)10-6-2-4-8-12(10)13/h1-8,13H,14H2
charge 0 multiplicity 1
25 atoms
N  -0.000014 2.691759 0.708684
C  -0.000013 1.644636 -0.338771
C  1.190738 0.6916 -0.193995
C  -1.190754 0.691592 -0.193998
C  0.738598 -0.646904 0.000145
C  -0.738605 -0.64691 0.000144
C  2.563089 0.984066 -0.235753
C  -2.563109 0.984046 -0.235754
C  1.665122 -1.700374 0.154467
C  -1.66512 -1.700387 0.154469
C  3.496325 -0.072768 -0.074739
C  -3.496335 -0.072795 -0.07474
C  3.048285 -1.402774 0.117493
C  -3.048285 -1.402798 0.117495
H  -0.00001 2.06846 -1.376313
H  2.921279 2.008745 -0.393512
H  -2.921303 2.008723 -0.393512
H  1.326594 -2.732142 0.302195
H  -1.326582 -2.732152 0.3022
H  -0.852483 3.258744 0.736008
H  0.852491 3.258688 0.736061
H  4.570994 0.139323 -0.102236
H  -4.571007 0.139285 -0.102237
H  3.781539 -2.208318 0.237548
H  -3.781535 -2.208346 0.237551
