program: Gaussian 09
title: 000096024
version: EM64L-G09RevD.01
frameworkgroup: C1[X(C9H9ClO2)]
method: RPBEPBE
basis: SDD
operation: Freq
keyword: #p
keyword: freq=noraman
keyword: PBEPBE/SDD
title: #p freq=noraman PBEPBE/SDD
converged: YES YES NO NO
title: Mulliken charges:
elementType: Cl O O C C C C C C C C C H H H H H H H H H
charge: -0.059159 -0.296351 -0.211896 0.370457 0.250971 -0.357405 -0.337541 -0.810314 -0.102935 -0.214602 0.247531 -0.743447 0.261444 0.254172 0.229044 0.232243 0.273135 0.259784 0.251982 0.249440 0.253445
chargesum: 0.00000
title: Mulliken charges with hydrogens summed into heavy atoms:
elementType: Cl O O C C C C C C C C C
charge: -0.059159 -0.296351 -0.211896 0.370457 0.250971 -0.095960 -0.083369 -0.075891 -0.102935 0.045183 0.247531 0.011419
polarizability: 1.63595104e+02 -1.64867254e+00 1.05501980e+02 5.77546039e+00 2.25607781e+00 6.41958150e+01
1716.lowfreq: -9.4455 -0.0023 -0.0015 -0.0012 1.4906 6.7437 25.2838 51.8096 71.4534
frequency: 24.0795 51.8068 71.4486 83.0182 143.6857 160.4690 197.3752 222.8697 275.1041 291.0589 339.3124 406.6076 439.3065 451.2887 523.2968 539.2691 566.1929 584.8601 657.5195 699.5208 740.5265 815.3162 835.7805 875.4175 880.3861 944.9482 989.0176 995.8697 1039.4134 1049.4659 1081.7341 1099.7296 1153.8614 1179.9342 1224.4474 1259.5202 1373.5783 1383.2972 1391.7185 1397.9798 1452.0133 1452.2066 1461.9213 1467.6744 1483.2799 1578.9344 1611.0762 1677.2839 2985.4072 3009.4939 3068.0928 3096.1448 3096.9152 3145.6536 3158.7687 3161.0028 3182.1406
redmass: 1.1850 7.4790 4.2066 2.9225 1.3212 4.3125 2.6915 5.0823 4.6773 4.5704 5.9203 5.7896 3.3444 3.2989 4.6758 3.6919 3.5069 5.2253 5.5529 4.6535 3.8881 1.7976 3.4582 1.3853 5.9921 1.3632 2.0045 1.5528 1.6543 1.5251 1.9057 2.4015 1.9743 2.9785 3.1450 1.2870 8.0428 1.2439 3.1788 1.2797 1.0581 1.0485 1.3748 1.6504 1.1600 6.3477 8.1443 9.9702 1.0367 1.0368 1.0977 1.0995 1.0973 1.1012 1.0924 1.0891 1.0978
irintensity: 1.9027 0.4508 1.2614 1.1012 2.4871 2.4611 2.8802 0.6752 3.4167 3.7208 0.8812 12.3005 6.6246 3.8755 1.4586 6.6352 3.7099 3.7918 11.3994 6.3042 1.5147 42.3435 99.5504 17.5987 13.3467 1.1710 75.0597 4.0151 8.5616 7.1331 31.4682 139.3883 296.4385 151.6833 0.9496 0.2606 3.0394 65.5507 5.1473 13.8420 30.1352 19.9655 32.1193 54.2307 58.9389 6.5502 8.8501 160.7518 17.7167 1.3880 9.0153 19.5654 3.7394 9.4974 2.8826 1.6348 2.2016
temp: 298.150 k
press: 1.00000 atm
elementType: 17 8 8 6 6 6 6 6 6 6 6 6 1 1 1 1 1 1 1 1 1
symmnumber: 1
zpe: 409888.7 jmol-1
zpe.correction: 0.156118 hartree
zpe.thermalcorrener: 0.168421 hartree
zpe.thermalcorrenthalpy: 0.169365 hartree
zpe.thermalcorrgfe: 0.115793 hartree
zpe.sumelectzpe: -957.994446 hartree
zpe.sumelectthermal: -957.982143 hartree
zpe.sumelectthermalent: -957.981199 hartree
zpe.sumelectthermalfe: -958.034771 hartree
dipole: -2.5969 -0.3604 -1.7770
dipole: 3.1672
quadrupole: -73.2911 -67.6890 -84.2169
quadrupole: 1.5080 4.4599 -2.0630
quadrupole: 1.7746 7.3767 -9.1512 1.5080 4.4599 -2.0630
hfenergy: -958.1505639 hartree
pointgroup: C01 [X(C9H9Cl1O2)]
dipole: -1.0215045 -0.0446605 0.7122295 debye
dipolederiv: -0.8697415 -0.0233784 0.0859225 0.0123739 -0.1312897 -0.0116966 0.1121899 -0.0081509 -0.0864072 -1.8900227 -0.0231417 -0.3386978 -0.1111033 -0.2683811 -0.0765247 -0.4295659 -0.0620186 -0.6142792 -0.6259245 0.0439948 0.1442761 -0.060939 -0.3013832 -0.1121436 -0.3802684 -0.0975792 -0.9073557 -0.0031165 0.1753693 -0.0112855 0.1653879 0.2182889 0.0059853 0.0845912 0.0528595 -0.0046937 1.1291548 -0.006428 0.0721304 -0.1371527 0.0495067 -0.0159535 -0.2345395 -0.0072132 -0.0118417 -0.3355222 -0.1509217 -0.0070212 -0.0435006 -0.0671625 0.0315419 0.0151439 0.0410943 -0.1077271 -0.1000209 -0.0015096 -0.0623647 0.0050751 0.0151276 0.0409956 -0.0063771 0.0233331 -0.1077424 -0.0659706 -0.1458233 -0.0213464 -0.0763282 -0.0535706 -0.0195269 -0.046846 -0.0674665 0.0168439 1.2476333 0.0241467 -0.1579557 -0.0443862 0.1413972 0.0408624 -0.1939154 0.0331289 -0.0275464 -0.3244655 0.0390937 0.0211394 0.0572275 -0.0353927 0.0056714 0.0318812 0.0103498 -0.125279 1.8693525 -0.0535106 0.1232657 0.1938556 0.2270368 0.235604 0.8641032 0.1722603 1.3511682 -0.3928954 0.0372935 0.1250035 0.0405734 0.01775 -0.0355097 0.1985759 -0.0285526 -0.0872373 0.0612552 0.0417283 0.0162902 0.055397 -0.01111 -0.0367829 0.02379 -0.0348243 0.1495057 0.0501761 0.0688314 0.037955 0.0644338 -0.0023565 -0.0358216 0.0299405 -0.0388329 0.1516391 -0.0073939 0.1557488 -0.0025316 0.0603223 -0.0594489 0.0053501 0.0062474 0.011678 0.1198991 -0.0020878 -0.0516715 0.1073977 -0.0424441 0.0574592 -0.0315946 0.115795 0.0367452 -0.0086924 0.051365 -0.0509373 -0.0779399 -0.0445946 0.0731279 0.0252835 -0.0885826 -0.0186397 -0.0105921 0.0428424 -0.0688662 -0.0023162 -0.0636912 0.0088809 -0.0244267 0.003371 -0.0238488 0.1647803 0.0910063 0.0200178 -0.0036096 -0.0303523 0.0389423 0.1074498 0.0008754 0.0957323 0.0288877 -0.0219997 -0.0084889 -0.0541572 -0.0267922 0.1203955 -0.0283472 -0.1031079 -0.0250479 0.0047445 0.0963756 -0.0215472 0.0058454 0.0266379 -0.0378176 -0.0704162 -0.003302 -0.0650067 0.1119258 unknown
polarizability: 163.2773435|5.2496225|103.2419991|-5.6337684|10.0436944|66.773557 unknown
InChI: InChI=1S/C9H9ClO2/c1-6-5-8(10)3-4-9(6)12-7(2)11/h3-5H,1-2H3
charge 0 multiplicity 1
21 atoms
Cl 4.311296 0.161724 -0.259448
O  -1.644754 0.301215 0.690919
O  -2.291135 -0.155348 -1.520387
C  0.372126 -1.007846 0.070269
C  -0.242529 0.230184 0.389454
C  1.776784 -0.999917 -0.125715
C  0.490312 1.424621 0.525213
C  -0.421786 -2.291116 -0.052169
C  2.504987 0.197513 0.000161
C  1.887912 1.419117 0.32836
C  -2.600144 0.097272 -0.342003
C  -3.990443 0.243014 0.23202
H  2.293351 -1.93227 -0.373292
H  -0.033915 2.348796 0.785481
H  0.242459 -3.170764 -0.035948
H  -1.150809 -2.391876 0.7724
H  -0.991884 -2.304162 -0.99919
H  2.473779 2.336574 0.427077
H  -4.139783 -0.47773 1.054374
H  -4.737465 0.07297 -0.556049
H  -4.119359 1.253328 0.657376
