program: Gaussian 09
title: 000096004
version: EM64L-G09RevD.01
frameworkgroup: C1[X(C11H9NO)]
method: RPBEPBE
basis: SDD
operation: Freq
keyword: #p
keyword: freq=noraman
keyword: PBEPBE/SDD
title: #p freq=noraman PBEPBE/SDD
converged: NO YES NO YES
title: Mulliken charges:
elementType: O N C C C C C C C C C C C H H H H H H H H H
charge: -0.247284 -0.404637 0.186071 0.429997 0.312502 -0.328529 -0.462726 -0.422233 -0.378600 -0.231982 -0.272332 -0.242462 -0.070751 0.187413 0.239815 0.240767 0.305865 0.230296 0.229726 0.232071 0.300073 0.166941
chargesum: 0.00000
title: Mulliken charges with hydrogens summed into heavy atoms:
elementType: O N C C C C C C C C C C C
charge: -0.247284 -0.104564 0.186071 0.429997 0.312502 -0.141116 -0.222911 -0.181465 -0.072736 -0.001686 -0.042606 -0.010391 0.096190
polarizability: 1.96284803e+02 -7.55457323e+00 1.52016008e+02 -3.56091261e-03 -4.76455031e-03 4.99635654e+01
1716.lowfreq: -13.0049 -6.4672 -0.0002 0.0003 0.0007 5.9060 48.8553 89.5887 173.4514
frequency: 48.8518 89.5718 173.4491 176.6381 216.7231 254.1992 343.8495 420.6884 427.6003 457.1623 471.8860 509.2294 549.8913 562.3033 625.6165 649.9699 678.8352 738.9822 780.7565 783.2314 808.7677 839.1211 847.7418 868.9019 928.3244 942.4532 953.0735 987.4359 996.7284 999.3828 1040.3525 1080.3443 1131.6192 1157.4603 1182.3324 1197.1611 1235.1125 1270.6590 1280.8242 1356.3942 1384.8328 1410.0698 1418.9196 1440.4612 1454.3515 1487.5867 1535.8981 1589.9933 1598.1822 1634.7041 1643.2393 2926.5782 3106.2138 3125.8139 3130.4489 3143.4435 3155.1421 3164.5001 3192.1301 3539.4447
redmass: 6.1356 3.2653 6.1551 4.0391 3.2032 8.9487 2.9845 4.3651 2.9119 6.5324 3.3540 7.1163 6.9600 2.2262 1.5095 3.1432 5.9148 1.3081 5.6921 2.0879 1.4004 6.4947 4.6835 1.8818 1.3829 1.5430 1.4177 1.3420 1.3557 5.3753 2.3405 2.1477 1.9685 1.4020 1.1029 1.3136 1.8979 1.6481 2.4200 2.2245 1.2694 2.7888 4.3369 2.5948 2.2780 2.4110 2.9294 7.2314 5.3342 6.6454 4.3625 1.0862 1.0867 1.0876 1.0871 1.0935 1.0966 1.1003 1.0949 1.0758
irintensity: 10.8506 3.9999 9.2753 2.3807 15.8826 3.1431 6.4567 2.7884 4.3428 8.1972 0.3557 0.1179 6.7093 0.0117 53.7182 15.6295 0.5762 24.3116 1.6017 71.8613 66.7427 6.8891 0.1850 20.7755 2.6429 3.2947 0.3698 0.3185 6.5479 2.2665 8.3990 6.5210 33.3036 0.3769 0.7488 1.1657 2.3153 3.2045 26.2900 29.3614 10.9000 37.3223 81.5149 0.8962 3.0274 231.0296 175.4099 17.0464 10.6614 29.9833 228.2153 116.1168 21.3338 0.6606 2.2617 29.0295 29.4846 26.6203 4.2786 18.1426
temp: 298.150 k
press: 1.00000 atm
elementType: 8 7 6 6 6 6 6 6 6 6 6 6 6 1 1 1 1 1 1 1 1 1
symmnumber: 1
zpe: 449470.4 jmol-1
zpe.correction: 0.171194 hartree
zpe.thermalcorrener: 0.181299 hartree
zpe.thermalcorrenthalpy: 0.182243 hartree
zpe.thermalcorrgfe: 0.135057 hartree
zpe.sumelectzpe: -553.665963 hartree
zpe.sumelectthermal: -553.655859 hartree
zpe.sumelectthermalent: -553.654915 hartree
zpe.sumelectthermalfe: -553.702101 hartree
dipole: 3.2439 -2.3283 0.0020
dipole: 3.9930
quadrupole: -82.9819 -59.5957 -81.0596
quadrupole: 5.8644 -0.0085 -0.0009
quadrupole: -8.4362 14.9500 -6.5138 5.8644 -0.0085 -0.0009
hfenergy: -553.8371575 hartree
pointgroup: C01 [X(C11H9N1O1)]
dipole: -1.3025423 0.8782401 0.0007792 debye
dipolederiv: -1.1824734 -0.0507999 0.0000447 0.6617763 -0.4278366 -0.0000534 0.0010738 -0.0000175 -0.3526932 -1.6033955 -0.4401358 0.0001977 -0.4537086 -0.4762137 0.0000732 0.0001724 0.0001841 -0.3007329 -0.0485856 -0.2438343 0.0000127 -0.0813491 -0.1004281 0.0000041 -0.0000168 -0.0000636 -0.0024371 0.0090524 -0.0619184 -0.0000142 -0.2158087 0.0486729 -0.0000094 -0.0000088 0.0000184 0.0699645 0.526575 0.3563913 0.0000898 0.7244174 0.4851923 0.0000139 0.0002226 0.0000763 0.0719438 -0.0441305 0.0709972 -0.0000223 0.0315246 0.0559921 -0.000017 -0.0000585 -0.0000416 -0.1731166 -0.1294044 0.1014143 0.0000007 0.0376951 -0.0137406 0.0000064 -0.0000215 0.0000025 -0.2005136 0.0480909 0.0567367 0.0000155 0.1257483 0.0709485 0.0000132 0.0000227 0.0000077 -0.1673497 -0.044997 0.0798135 0.0000428 -0.1838974 -0.2261438 -0.0000105 -0.0000549 -0.0000064 -0.1712633 0.0375418 -0.0560342 0.0000172 0.0682189 0.1928655 0.0000157 0.000001 0.0000397 -0.1459611 -0.0812751 -0.0199955 0.0000138 0.015761 0.1233612 -0.0000186 0.0000091 -0.0000309 -0.1599897 0.1190801 0.0408777 0.0000194 0.0163845 -0.0905509 0.0000011 0.0000218 0.0000117 -0.1635897 2.1326142 0.2285996 -0.0004016 -0.4947134 0.6637482 0.0000693 -0.0015173 -0.0002666 0.1383547 -0.0213596 -0.1498625 -0.0000137 -0.1059954 -0.0719411 0.0000092 0.0000072 0.0000236 0.1548365 -0.0018431 -0.1265944 -0.0000144 -0.0567957 -0.029333 -0.000006 -0.0000053 -0.0000188 0.162798 0.0171357 -0.0520391 -0.000009 -0.1236949 -0.0466439 -0.0000095 -0.0000025 -0.0000066 0.1542741 0.0659996 0.033716 -0.0000332 0.0230066 0.1351071 0.0000009 -0.0000485 -0.0000443 0.1846159 0.0566036 0.080832 -0.0000063 0.0604356 -0.094785 0.0000009 0.0000076 0.0000033 0.1556283 0.0504969 0.0716371 -0.0000102 0.0885909 -0.0965529 0.0000172 -0.0000189 0.0000173 0.1620658 -0.1367546 0.0289237 -0.0000209 0.0311501 0.0873966 0.000004 -0.0000224 0.0000048 0.1645744 0.2055403 0.0570151 0.0000576 -0.009672 0.0910909 -0.0000595 -0.0000508 -0.000112 0.295942 0.0254882 -0.0057401 0.0000339 -0.159074 -0.2802059 -0.0000453 0.0002882 0.0002187 0.1226488 unknown
polarizability: 196.6893751|-6.244837|151.6114359|0.0034198|0.0048669|49.9635654 unknown
InChI: InChI=1S/C11H9NO/c13-8-12-11-7-3-5-9-4-1-2-6-10(9)11/h1-8,12H
charge 0 multiplicity 1
22 atoms
O  4.024056 0.271224 -0.000678
N  1.84725 1.212775 0.000602
C  -0.449151 0.311294 0.000152
C  -1.329478 -0.841897 0.000054
C  0.984332 0.079543 0.000331
C  -1.047855 1.616571 0.000061
C  -0.77514 -2.163579 0.000057
C  -2.749448 -0.63881 -0.000064
C  1.495691 -1.229369 0.000314
C  0.60736 -2.344055 0.000171
C  -2.435468 1.782452 -0.000057
C  -3.298458 0.643698 -0.000094
C  3.238761 1.256186 0.00047
H  -0.432454 2.52513 0.000014
H  -1.453846 -3.023917 -0.000007
H  -3.401305 -1.520564 -0.000117
H  2.576752 -1.378259 0.000441
H  1.03182 -3.353676 0.000172
H  -2.8644 2.790269 -0.000137
H  -4.384657 0.782935 -0.000172
H  1.394208 2.128464 0.000959
H  3.600729 2.310687 0.000025
