program: Gaussian 09
title: 000096012
version: EM64L-G09RevD.01
frameworkgroup: C1[X(C12H27N)]
method: RPBEPBE
basis: SDD
operation: Freq
keyword: #pfreq=noraman
keyword: PBEPBE/SDD
title: #p freq=noraman PBEPBE/SDD
converged: YES YES NO NO
title: Mulliken charges:
elementType: N C C C C C C C C C C C C H H H H H H H H H H H H H H H H H H H H H H H H H H H
charge: -0.363793 0.036659 -0.043158 -0.466999 -0.447345 -0.036364 0.008913 -0.736299 -0.724730 -0.702249 -0.725988 -0.734696 -0.724897 0.172993 0.214345 0.222430 0.188404 0.186950 0.193573 0.266869 0.193824 0.180616 0.224187 0.208306 0.213813 0.201758 0.213527 0.217916 0.212643 0.210157 0.207670 0.209092 0.218278 0.213048 0.207072 0.207089 0.232254 0.196030 0.247291 0.200808
chargesum: 0.00000
title: Mulliken charges with hydrogens summed into heavy atoms:
elementType: N C C C C C C C C C C C C
charge: -0.096924 0.209652 0.171187 -0.056165 -0.066822 0.157460 0.189529 -0.089993 -0.091528 -0.071778 -0.085569 -0.088281 -0.080768
polarizability: 1.55121795e+02 -6.65299372e-02 1.31718624e+02 -1.05194565e-01 2.84942107e-01 1.29106960e+02
1716.lowfreq: -15.7105 -2.9312 -0.0004 0.0003 0.0006 9.7691 21.4824 37.8992 43.6022
frequency: 15.9917 37.8010 43.1866 74.1811 79.0254 117.5328 144.2068 175.3297 185.1424 207.1120 225.0811 227.8204 247.5835 249.3185 266.6725 295.0887 308.5074 346.5001 349.4488 362.2184 379.4795 398.3865 416.4804 442.9683 485.5434 550.9478 579.2407 619.6197 768.3259 775.0026 814.8199 860.7794 868.4548 877.4886 909.0543 916.3835 921.1307 939.9485 956.1018 957.8814 977.0309 988.4224 1024.4919 1028.3612 1044.3927 1076.2993 1087.3342 1100.9757 1143.0925 1159.0785 1172.5347 1174.8015 1193.6629 1199.8497 1233.4660 1248.5793 1283.2858 1298.4716 1312.6693 1322.8790 1323.8171 1335.0234 1340.0261 1346.2948 1358.2545 1366.6038 1369.6803 1377.8823 1378.6164 1380.7231 1387.2606 1394.9325 1439.3528 1455.4911 1458.5717 1462.5498 1464.7768 1468.4503 1471.2232 1474.4315 1476.6870 1479.2942 1481.5216 1486.1299 1489.0841 1493.4173 1495.4540 2867.9725 2934.6195 2949.7491 2952.5039 2961.2883 2963.9389 2964.7956 2966.7270 2969.6761 2973.9134 2978.0426 2995.6241 3012.0903 3028.7710 3051.6787 3054.5875 3057.6344 3060.2767 3061.2914 3063.3475 3066.2891 3067.8624 3068.5181 3071.1542 3077.8908 3088.5587 3442.6123
redmass: 3.1190 2.7666 2.8851 2.7726 2.9327 2.2845 2.5440 1.7597 1.4206 1.2712 1.1120 1.1200 1.0848 2.2341 2.0616 1.1572 2.2004 2.1661 2.1229 2.0556 2.1228 1.9705 2.3986 2.6401 1.6941 2.2775 2.3409 1.9064 2.8395 2.6870 1.7993 1.9834 1.5791 1.6614 1.7804 1.1980 1.2373 1.9869 1.4320 1.4948 1.8906 1.7522 1.4836 1.5550 2.0333 1.9685 1.8294 1.7742 2.0868 2.0827 2.3584 2.3737 1.9467 2.0211 1.2511 1.2490 1.3950 1.3220 1.4013 1.4195 1.4310 1.3884 1.3470 1.3370 1.3594 1.4157 1.2259 1.2250 1.2123 1.2170 1.2198 1.2163 1.1600 1.0891 1.0703 1.0454 1.0621 1.0583 1.0626 1.0577 1.0530 1.0553 1.0498 1.0518 1.0552 1.0642 1.0541 1.0798 1.0696 1.0734 1.0786 1.0355 1.0357 1.0364 1.0365 1.0390 1.0431 1.0566 1.0852 1.0939 1.1013 1.0991 1.1001 1.0992 1.0990 1.0990 1.0988 1.0992 1.0999 1.0986 1.0987 1.1001 1.0990 1.0739
irintensity: 0.1052 0.0679 0.1864 0.3653 0.2088 0.0120 0.0281 0.4702 0.5671 0.0781 0.4378 0.8959 0.4565 0.5156 0.0497 1.5606 0.1892 0.0965 0.6066 1.5667 0.4267 1.0517 0.8062 2.0528 18.5438 6.8770 31.5078 48.7801 1.1572 0.5235 8.0782 11.9759 1.8510 0.6128 3.8244 5.6332 0.6853 2.3712 0.0262 0.1691 3.5799 12.0789 1.5537 2.4387 5.9335 7.7411 2.2971 1.9814 1.1661 9.5135 52.9765 37.6251 7.7668 3.8230 1.6563 1.8980 3.5095 5.2985 4.0053 11.8813 10.1755 2.3381 7.2575 2.8068 10.3345 7.0039 16.8396 13.6972 11.2943 20.4272 25.1590 21.3762 27.5046 10.2845 3.4794 5.7851 7.9619 3.3115 7.2740 8.0399 1.2129 15.6854 11.3097 16.9619 13.5482 10.8029 16.6138 80.6073 18.3146 54.6877 16.2928 40.3992 62.4131 37.6979 35.9560 15.1104 22.4515 39.5973 24.7381 43.3039 26.5268 37.9404 25.7451 14.8332 72.5790 79.2685 69.3192 78.8992 20.7011 83.1323 34.6882 45.7739 31.7320 1.1031
temp: 298.150 k
press: 1.00000 atm
elementType: 7 6 6 6 6 6 6 6 6 6 6 6 6 1 1 1 1 1 1 1 1 1 1 1 1 1 1 1 1 1 1 1 1 1 1 1 1 1 1 1
symmnumber: 1
zpe: 967015.9 jmol-1
zpe.correction: 0.368317 hartree
zpe.thermalcorrener: 0.386103 hartree
zpe.thermalcorrenthalpy: 0.387047 hartree
zpe.thermalcorrgfe: 0.322350 hartree
zpe.sumelectzpe: -527.097949 hartree
zpe.sumelectthermal: -527.080163 hartree
zpe.sumelectthermalent: -527.079219 hartree
zpe.sumelectthermalfe: -527.143916 hartree
dipole: 0.7140 -0.0478 0.7099
dipole: 1.0080
quadrupole: -85.0917 -86.0202 -87.2431
quadrupole: 1.4412 -1.8355 0.5560
quadrupole: 1.0266 0.0982 -1.1248 1.4412 -1.8355 0.5560
hfenergy: -527.4662658 hartree
pointgroup: C01 [X(C12H27N1)]
dipole: -0.2725546 0.0333724 0.286128 debye
polarizability: 155.0959596|-0.5382119|131.7093044|-0.6130176|-0.3558911|129.1421147 unknown
InChI: InChI=1S/C12H27N/c1-9(2)7-11(5)13-12(6)8-10(3)4/h9-13H,7-8H2,1-6H3
charge 0 multiplicity 1
40 atoms
N  0.170263 0.068077 -0.038695
C  -1.045498 0.78377 -0.516741
C  1.209925 0.823455 0.709567
C  -2.046499 -0.254232 -1.10453
C  2.378905 -0.118774 1.103287
C  -3.112962 -0.84029 -0.130923
C  3.207626 -0.792972 -0.033352
C  -0.656306 1.831535 -1.584042
C  0.680557 1.547983 1.983179
C  -4.153925 0.225245 0.293959
C  -2.505909 -1.535512 1.112362
C  3.628264 0.215406 -1.128938
C  2.510059 -2.024793 -0.66221
H  -1.559596 1.328302 0.313677
H  1.610426 1.598689 0.028087
H  -1.449449 -1.076506 -1.548906
H  -2.593789 0.22216 -1.942252
H  1.980592 -0.91128 1.775287
H  3.074868 0.483753 1.722699
H  -0.077214 -0.79754 0.45923
H  -3.658188 -1.618297 -0.707788
H  4.137106 -1.160506 0.454852
H  -0.184528 1.332051 -2.450183
H  -1.553849 2.374714 -1.932817
H  0.055318 2.580543 -1.191389
H  0.324776 0.813659 2.732345
H  1.47995 2.152636 2.451866
H  -0.156764 2.229405 1.745672
H  -4.634797 0.687953 -0.58835
H  -4.948645 -0.225546 0.917784
H  -3.684725 1.034186 0.885981
H  -1.7786 -2.318922 0.823422
H  -1.992763 -0.807484 1.769513
H  -3.297973 -2.020492 1.713145
H  4.124016 1.105495 -0.695957
H  4.334417 -0.253413 -1.839803
H  2.747341 0.55387 -1.70455
H  2.22906 -2.762912 0.114285
H  1.594494 -1.713655 -1.193022
H  3.184816 -2.531361 -1.378748
