program: Gaussian 09
title: 000012301
version: EM64L-G09RevD.01
frameworkgroup: C1[X(C4H8O3)]
method: RPBEPBE
basis: SDD
operation: Freq
keyword: #p
keyword: freq=noraman
keyword: PBEPBE/SDD
title: #p freq=noraman PBEPBE/SDD
converged: YES YES NO NO
title: Mulliken charges:
elementType: O O O C C C C H H H H H H H H
charge: -0.255845 -0.429428 -0.197568 -0.209876 -0.299533 -0.672676 0.173129 0.191158 0.191066 0.228012 0.227570 0.202090 0.233743 0.233902 0.384256
chargesum: 0.00000
title: Mulliken charges with hydrogens summed into heavy atoms:
elementType: O O O C C C C
charge: -0.255845 -0.045172 -0.197568 0.172349 0.156050 -0.002942 0.173129
polarizability: 6.94679715e+01 1.04764067e+00 5.39190538e+01 5.19601459e-02 2.21268605e-02 3.86865981e+01
1716.lowfreq: -16.0158 -5.1056 -0.0011 -0.0008 -0.0004 5.2142 31.7106 69.8716 116.9786
frequency: 31.0221 69.8419 116.9775 124.1242 235.1078 294.9532 336.9388 483.6556 499.5772 581.4777 622.6156 817.3668 843.5746 872.8108 1000.8638 1004.2586 1043.4085 1099.2865 1119.2427 1137.9687 1195.1984 1251.4843 1253.0805 1345.9096 1391.5157 1405.3933 1448.2603 1459.0838 1478.4742 1492.5995 1702.3641 2917.7197 2927.1236 2964.5480 2969.4422 2998.4908 3096.0611 3107.6252 3526.3635
redmass: 2.6245 3.3785 2.3671 4.4717 1.1501 4.7279 4.7797 3.7182 1.7521 4.7945 1.4897 1.0871 3.3856 3.4718 1.9456 2.9772 2.7194 5.5843 2.1608 1.4380 1.0902 1.6139 1.1456 1.4018 1.2901 1.4746 1.0895 1.0400 1.0486 1.0792 9.2054 1.0552 1.0548 1.1021 1.1066 1.0360 1.0990 1.1011 1.0642
irintensity: 1.8987 3.6977 6.9826 1.5526 0.6927 0.0206 9.7176 4.3472 32.8840 25.1193 142.2271 4.3676 7.8167 3.0576 4.0861 188.6279 246.1459 52.1214 17.3271 7.0197 2.6935 21.6555 0.2078 0.5254 5.7082 41.8172 20.4007 11.2843 5.6556 7.9410 224.0744 43.5679 77.6952 84.9832 15.6905 19.7932 31.7979 34.3375 26.2965
temp: 298.150 k
press: 1.00000 atm
elementType: 8 8 8 6 6 6 6 1 1 1 1 1 1 1 1
symmnumber: 1
zpe: 312619.0 jmol-1
zpe.correction: 0.119070 hartree
zpe.thermalcorrener: 0.127520 hartree
zpe.thermalcorrenthalpy: 0.128465 hartree
zpe.thermalcorrgfe: 0.084800 hartree
zpe.sumelectzpe: -382.301672 hartree
zpe.sumelectthermal: -382.293222 hartree
zpe.sumelectthermalent: -382.292278 hartree
zpe.sumelectthermalfe: -382.335943 hartree
dipole: 0.4389 -3.0053 0.0198
dipole: 3.0373
quadrupole: -31.6512 -47.1312 -41.1609
quadrupole: -0.8516 0.0295 -0.0356
quadrupole: 8.3299 -7.1501 -1.1798 -0.8516 0.0295 -0.0356
hfenergy: -382.4207423 hartree
pointgroup: C01 [X(C4H8O3)]
dipole: 0.1826969 1.1808325 -0.0131089 debye
dipolederiv: -1.1456021 0.0236579 -0.00049 0.0373977 -0.3513679 -0.0004984 -0.0006893 -0.0006883 -0.419 -1.0675526 0.5119812 0.0035268 0.4390151 -0.5939307 -0.002144 0.0044759 -0.0022513 -0.441822 -0.6051806 -0.1501717 0.0016753 0.1170061 -0.9649871 -0.0003944 0.002087 0.0012038 -0.2948785 0.8310427 0.105304 -0.0017319 0.2664795 0.3361015 0.0020235 -0.0046119 0.0017246 0.4629876 0.4622415 -0.2230855 0.0045453 -0.5741281 0.1037123 0.0034608 0.0110868 0.0040495 0.43972 -0.1131274 0.0777976 -0.0012944 0.0779921 0.0009953 0.0006405 -0.0011611 0.0005858 0.0475554 1.4501862 -0.1832246 -0.00799 -0.2514274 1.4062612 0.0004302 -0.0101638 -0.0006615 0.1988458 -0.043468 0.0216458 -0.0332482 -0.0721584 -0.0694362 0.1286055 0.0267825 0.1559464 -0.1303137 -0.0435397 0.022432 0.032291 -0.0732378 -0.0790575 -0.1301778 -0.0246373 -0.1575856 -0.1206303 -0.018597 0.0013786 -0.0060143 0.1073108 -0.0127501 -0.0973892 0.0403435 -0.1250528 -0.064711 -0.0187649 0.0003789 0.0063572 0.1054786 -0.0068816 0.0957674 -0.0446104 0.1233779 -0.0716312 -0.1393674 -0.0822333 0.0016107 -0.1107141 0.0283554 0.0016146 0.0021251 0.0015664 0.1133139 0.1071022 -0.0107335 0.0263088 0.0372669 0.014519 0.1038541 -0.0010171 0.1164874 -0.0647242 0.1071386 -0.0118695 -0.0261933 0.0370806 0.0069618 -0.1063037 -0.0005582 -0.1187822 -0.0567207 0.2374886 -0.1032578 0.0006472 -0.1433616 0.1815046 0.0005111 0.0005485 0.00008 0.4020091 unknown
polarizability: 69.4490695|-1.1795583|53.9378344|-0.0521277|-0.0454628|38.6867196 unknown
InChI: InChI=1S/C4H8O3/c1-2-7-3-4(5)6/h5H,2-3H2,1H3
charge 0 multiplicity 1
15 atoms
O  0.846265 -0.165449 0.005761
O  -2.685078 0.727839 0.007143
O  -1.678334 -1.373353 0.002256
C  2.109941 0.593308 -0.007529
C  -0.30704 0.708539 -0.007871
C  3.246894 -0.425586 0.009173
C  -1.571723 -0.136045 0.000837
H  2.155427 1.230728 -0.919082
H  2.156327 1.261178 0.881899
H  -0.33399 1.382914 0.877461
H  -0.331131 1.357867 -0.912127
H  4.225268 0.088178 -0.000579
H  3.187038 -1.053848 0.913907
H  3.185477 -1.084852 -0.873126
H  -3.51944 0.185481 0.010376
