program: Gaussian 09
title: 000095941
version: EM64L-G09RevD.01
frameworkgroup: C1[X(C5H5NO2)]
method: RPBEPBE
basis: SDD
operation: Freq
keyword: #pfreq=noraman
keyword: PBEPBE/SDD
title: #p freq=noraman PBEPBE/SDD
converged: NO YES NO NO
title: Mulliken charges:
elementType: O O N C C C C C H H H H H
charge: -0.189517 -0.189768 -0.407382 0.312826 0.097430 -0.408258 0.168286 -0.757636 0.281629 0.352276 0.253241 0.233635 0.253237
chargesum: 0.00000
title: Mulliken charges with hydrogens summed into heavy atoms:
elementType: O O N C C C C C
charge: -0.189517 -0.189768 -0.055106 0.312826 0.097430 -0.126629 0.168286 -0.017522
polarizability: 9.63238500e+01 9.95814328e+00 6.42808473e+01 8.35101886e-04 8.49200313e-06 3.22686435e+01
1716.lowfreq: -3.0904 -0.0010 -0.0002 0.0002 1.7274 7.6820 89.8510 162.5297 184.8784
frequency: 89.8335 162.5272 184.8743 243.5682 361.0235 381.4247 540.6097 569.4752 613.1210 628.0206 680.6180 742.7451 750.3015 857.5847 912.9133 991.1842 1040.3149 1066.8571 1174.2647 1257.0308 1296.1556 1308.8785 1400.9719 1448.3594 1457.1691 1643.1506 1650.5701 1679.8624 2987.2011 3062.6959 3108.7303 3213.0223 3588.0528
redmass: 1.0678 9.4186 3.5202 3.2194 10.1855 3.7149 4.2713 5.0773 1.0965 9.8481 3.6845 6.5648 4.0845 1.5292 3.2917 1.4981 1.5593 4.9152 1.6924 4.9611 2.2331 2.6370 1.2599 1.0440 1.0730 7.4461 7.7147 11.5652 1.0377 1.0958 1.1000 1.0997 1.0805
irintensity: 1.1622 3.5237 1.5867 2.2178 15.0869 4.1860 14.1661 0.6777 121.4878 2.1214 10.0943 6.4171 3.5584 54.4953 16.5244 18.2168 7.8116 35.6673 0.0596 103.5715 27.1956 31.4130 29.0667 16.3829 16.0225 69.5706 512.5051 27.0070 4.6219 7.6460 13.1518 0.8311 74.9498
temp: 298.150 k
press: 1.00000 atm
elementType: 8 8 7 6 6 6 6 6 1 1 1 1 1
symmnumber: 1
zpe: 245791.4 jmol-1
zpe.correction: 0.093617 hartree
zpe.thermalcorrener: 0.100860 hartree
zpe.thermalcorrenthalpy: 0.101804 hartree
zpe.thermalcorrgfe: 0.061895 hartree
zpe.sumelectzpe: -398.160088 hartree
zpe.sumelectthermal: -398.152845 hartree
zpe.sumelectthermalent: -398.151901 hartree
zpe.sumelectthermalfe: -398.191809 hartree
dipole: 1.6488 -1.6370 -0.0001
dipole: 2.3234
quadrupole: -55.5396 -43.5554 -45.8982
quadrupole: -9.4341 0.0006 -0.0006
quadrupole: -7.2085 4.7756 2.4329 -9.4341 0.0006 -0.0006
hfenergy: -398.2537046 hartree
pointgroup: C01 [X(C5H5N1O2)]
dipole: 0.5898926 0.6983067 0.0002474 debye
dipolederiv: -0.8471178 0.1824881 -0.0000427 0.4113761 -0.6761575 -0.0000051 0.000075 -0.0000812 -0.3287835 -1.1237441 0.1605319 -0.0000458 -0.0793912 -0.4573839 -0.0000293 -0.0001443 0.0000027 -0.341461 -1.0913368 0.1756917 -0.0000578 0.0729805 -0.8458629 -0.0000954 -0.0000951 -0.0001273 -0.3638135 0.5222066 0.2004389 0.0000383 0.2774229 -0.1525608 -0.0000194 0.0000261 -0.0000132 -0.0384849 1.3614939 -0.1723456 0.0001068 -0.342604 0.8676721 0.0000939 0.0000319 0.0001381 0.2488083 -0.467591 -0.2639596 -0.0000513 -0.2687699 -0.0487942 -0.000028 -0.0000508 -0.0000024 -0.168113 1.4831517 -0.2591229 0.0000789 -0.0036998 1.0395341 0.00014 0.0001559 0.0001308 0.2850313 -0.2788111 -0.117507 -0.0000129 -0.0375565 0.0253702 0.0000256 0.0001691 0.0000668 0.0409351 0.0985228 0.0198719 -0.0000118 0.0001737 -0.0151503 -0.0000332 -0.0000216 -0.0000351 0.1858841 0.1635045 0.0232583 -0.0000218 0.0321517 0.2153831 -0.0000255 -0.0000131 -0.000013 0.3721973 0.057449 0.0002697 -0.0695314 -0.0161662 0.082486 0.0665031 -0.0922135 0.0336645 -0.005359 0.0648144 0.0501982 0.0000357 -0.0296013 -0.1171436 -0.0001439 -0.0000556 -0.0001438 0.1187049 0.0574577 0.0001864 0.0695157 -0.0163161 0.0826077 -0.0663829 0.092136 -0.0335869 -0.0055459 unknown
polarizability: 97.8137339|-7.0145923|62.790962|0.0046308|0.0052782|32.2686449 unknown
InChI: InChI=1S/C5H5NO2/c1-3-2-4(7)6-5(3)8/h2,6H,1H3
charge 0 multiplicity 1
13 atoms
O  1.653654 -1.624922 -0.000125
O  -2.719985 0.105582 -0.000264
N  -0.673935 -1.113864 -0.000231
C  0.788981 0.718034 0.000331
C  0.705317 -0.803277 0.000044
C  -0.486481 1.20701 0.000303
C  -1.466064 0.066931 -0.000052
C  2.109349 1.421324 0.000528
H  -0.815358 2.24627 0.000427
H  -1.052079 -2.061405 -0.000439
H  2.70652 1.126993 0.883713
H  1.987776 2.516338 0.001202
H  2.706206 1.128087 -0.883235
