program: Gaussian 09
title: 000012297
version: EM64L-G09RevD.01
frameworkgroup: C1[X(C6H14O)]
method: RPBEPBE
basis: SDD
operation: Freq
keyword: #pfreq=noraman
keyword: PBEPBE/SDD
title: #p freq=noraman PBEPBE/SDD
converged: YES YES NO NO
title: Mulliken charges:
elementType: O C C C C C C H H H H H H H H H H H H H H
charge: -0.452155 -0.397081 -0.365321 -0.024676 -0.350736 -0.699217 -0.693300 0.211493 0.178406 0.206130 0.184556 0.177660 0.193609 0.199380 0.210524 0.234731 0.221461 0.210593 0.209672 0.217044 0.327225
chargesum: 0.00000
title: Mulliken charges with hydrogens summed into heavy atoms:
elementType: O C C C C C C
charge: -0.124930 -0.007182 0.025365 0.152985 0.042254 -0.032500 -0.055992
polarizability: 8.14487491e+01 5.32927096e-01 6.76303218e+01 6.58833744e-01 -1.39654088e-01 5.92930273e+01
1716.lowfreq: -22.9668 -0.0007 -0.0006 0.0005 12.4855 14.8579 61.1222 74.7924 122.1018
frequency: 60.9992 74.7184 122.0794 137.4193 207.7364 233.9624 283.4401 300.9625 319.6551 415.6331 426.3674 495.9248 727.8273 783.4264 832.5087 893.9190 907.4132 913.4549 1002.3874 1023.6439 1052.0672 1075.9267 1090.4618 1117.8486 1171.9779 1213.9882 1234.1168 1253.6339 1276.9582 1290.4707 1311.2503 1342.0260 1354.2237 1376.1578 1390.3068 1398.7134 1455.4743 1461.1500 1466.0350 1476.0589 1478.1590 1479.2471 1486.8740 2923.6564 2945.2406 2957.7550 2968.8034 2972.6477 2991.9774 3000.1744 3016.6412 3039.6990 3069.5247 3072.2319 3092.3864 3097.4887 3550.9322
redmass: 1.7718 2.6148 3.0372 1.8457 1.1646 1.1117 2.7386 2.2645 1.3285 2.4434 2.6484 2.8055 1.0819 1.2643 2.4117 1.8076 1.2268 2.3191 1.2340 3.0493 2.3277 2.4568 1.5121 2.2823 2.0372 1.4237 1.2759 1.2370 1.2024 1.0636 1.2455 1.3882 1.6382 1.2655 1.2186 1.5310 1.0789 1.0515 1.0711 1.0647 1.0426 1.0547 1.0827 1.0839 1.0636 1.0602 1.0602 1.0366 1.0363 1.0940 1.0994 1.1028 1.1008 1.0992 1.0997 1.0996 1.0658
irintensity: 0.2615 0.9993 0.4392 0.2708 5.8949 0.4166 0.0490 22.9083 132.1902 2.5362 10.5406 7.5584 10.1317 0.7863 8.9680 5.4060 4.3185 31.0302 10.1459 9.3694 34.0747 0.2936 4.2868 28.4224 15.2405 15.0000 41.7266 0.8002 0.9818 1.6083 1.9588 15.1243 1.1329 14.1265 12.8733 30.3544 0.6744 5.5049 1.2544 0.5874 12.7975 11.2086 17.2292 58.3201 28.7358 9.3954 80.5127 32.1687 14.8017 7.8337 1.7953 71.1286 91.7656 52.0304 38.9936 32.1989 5.0383
temp: 298.150 k
press: 1.00000 atm
elementType: 8 6 6 6 6 6 6 1 1 1 1 1 1 1 1 1 1 1 1 1 1
symmnumber: 1
zpe: 497142.7 jmol-1
zpe.correction: 0.189352 hartree
zpe.thermalcorrener: 0.199028 hartree
zpe.thermalcorrenthalpy: 0.199972 hartree
zpe.thermalcorrgfe: 0.154750 hartree
zpe.sumelectzpe: -311.644359 hartree
zpe.sumelectthermal: -311.634682 hartree
zpe.sumelectthermalent: -311.633738 hartree
zpe.sumelectthermalfe: -311.678961 hartree
dipole: 1.8534 -0.4899 0.7675
dipole: 2.0649
quadrupole: -54.8866 -42.4870 -45.5064
quadrupole: 0.3991 -2.1316 -1.3954
quadrupole: -7.2599 5.1397 2.1203 0.3991 -2.1316 -1.3954
hfenergy: -311.8337104 hartree
pointgroup: C01 [X(C6H14O1)]
dipole: -0.729004 0.1892868 0.3045247 debye
dipolederiv: -0.8143554 -0.2780018 -0.1016769 -0.2895654 -0.4424123 0.1441373 -0.1110403 0.149474 -0.4776285 -0.1867668 -0.036018 -0.0272165 0.0867821 0.0678731 0.0543718 -0.0547567 0.0670187 0.0970469 -0.0503741 -0.018126 -0.0161514 0.015731 0.077735 0.0485174 -0.0527361 0.0354173 0.1611201 0.6272985 0.167569 -0.0040749 0.1295717 0.5148373 -0.0651387 0.0578618 -0.0576525 0.4117474 0.0562715 -0.0125725 -0.0016297 -0.0421458 0.1178321 0.0308757 0.0302361 0.0318852 0.1579577 -0.0127275 0.0661635 0.0069733 0.0337021 -0.1425828 -0.0551 -0.0156767 -0.0604332 0.0454252 -0.0767234 -0.0459286 0.0167024 -0.0180952 0.0561635 0.0177896 0.0027282 0.0177574 0.0872074 0.0424528 -0.0049123 0.0204093 -0.0097553 0.065718 0.004984 0.0104654 0.0382875 -0.1606663 0.0255038 0.026263 0.005523 0.0100105 -0.2003255 -0.0707215 -0.0066118 -0.0980238 0.0366833 0.0543462 0.0017878 0.0023127 0.0113853 -0.1556141 -0.0695988 0.0114668 -0.0862713 0.0308702 0.0443284 0.0021936 -0.0073998 -0.00323 0.0525818 0.0369988 0.0054335 0.0616512 -0.1906687 -0.0348677 -0.0327605 0.0527163 -0.0041728 -0.0212529 0.0025822 0.0414962 0.0363689 -0.2540099 0.0221151 -0.0242958 -0.0084382 0.0115086 -0.1724068 -0.0807585 0.0000692 -0.1095799 0.033656 0.0263993 -0.0120687 0.0366415 -0.0008357 0.0580837 0.0433306 0.001137 0.0697921 -0.1896109 -0.014038 -0.1461758 0.0513245 -0.127459 -0.0149558 0.024217 0.0549644 0.0338922 0.0665356 -0.1109216 0.111547 -0.0665191 0.0776076 0.0664134 0.0192495 -0.0771432 0.0225148 0.0686764 0.1072712 0.0107823 -0.0102503 -0.0013599 0.076416 0.0370514 0.0173478 -0.0197369 -0.1494577 0.0809242 0.0213671 0.0244686 -0.0429547 -0.1409742 -0.0938045 0.0058503 -0.1090545 0.0362288 0.0798032 -0.0118593 -0.0152485 -0.0308722 0.0741634 0.0327581 0.0482715 0.0510858 -0.1817632 -0.1780055 0.0793327 -0.0530455 0.1107908 0.0331348 0.0402864 -0.0702574 0.0396022 0.0766319 0.3120658 0.1357132 0.0945794 0.0833562 0.0295721 -0.102028 0.1008942 -0.1139952 0.2940183 unknown
polarizability: 81.447243|0.5455508|67.6269552|-0.6711573|0.2256452|59.2979 unknown
InChI: InChI=1S/C6H14O/c1-3-4-5-6(2)7/h6-7H,3-5H2,1-2H3
charge 0 multiplicity 1
21 atoms
O  2.795335 0.841109 0.012197
C  0.329924 0.576486 -0.200715
C  -0.941751 -0.21051 0.192166
C  1.640321 -0.022854 0.356651
C  -2.246211 0.496378 -0.242657
C  1.990798 -1.399789 -0.216782
C  -3.513789 -0.300962 0.1329
H  0.413357 0.641028 -1.304123
H  0.229397 1.619739 0.172875
H  -0.911664 -1.221705 -0.260546
H  -0.960753 -0.360729 1.292671
H  1.554153 -0.09524 1.465563
H  -2.288258 1.502174 0.223141
H  -2.222451 0.662692 -1.338919
H  1.23519 -2.152834 0.067163
H  2.972584 -1.727403 0.165738
H  2.049542 -1.348988 -1.318894
H  -3.511096 -1.298185 -0.346271
H  -3.575596 -0.455348 1.226824
H  -4.432464 0.224553 -0.186451
H  2.601833 1.764789 0.315966
