program: Gaussian 09
title: 000095911
version: EM64L-G09RevD.01
frameworkgroup: C1[X(C8H13F3O)]
method: RPBEPBE
basis: SDD
operation: Freq
keyword: #p
keyword: freq=noraman
keyword: PBEPBE/SDD
title: #p freq=noraman PBEPBE/SDD
converged: YES YES NO NO
title: Mulliken charges:
elementType: F F F O C C C C C C C C H H H H H H H H H H H H H
charge: -0.163924 -0.163754 -0.129170 -0.136626 -0.359182 -0.363891 -0.351841 -0.508463 -0.355397 -0.693762 0.126175 0.322883 0.189929 0.190238 0.222003 0.220800 0.191727 0.191658 0.269915 0.270168 0.195462 0.195491 0.210982 0.210885 0.217694
chargesum: 0.00000
title: Mulliken charges with hydrogens summed into heavy atoms:
elementType: F F F O C C C C C C C C
charge: -0.163924 -0.163754 -0.129170 -0.136626 0.020986 0.078912 0.031544 0.031619 0.035556 -0.054201 0.126175 0.322883
polarizability: 1.12027731e+02 2.23917295e+00 8.63687806e+01 -2.28391968e-02 -1.00126373e-04 7.26046458e+01
1716.lowfreq: -14.4485 -0.0005 -0.0001 0.0006 5.7153 6.6016 30.2174 31.7903 55.9164
frequency: 26.7031 30.3026 55.8456 57.0597 78.4449 119.8262 138.7619 141.7792 197.5744 215.2630 225.4928 245.5027 317.7202 369.6160 406.3351 430.2397 443.8424 519.3972 558.4020 629.7137 724.0426 736.6123 760.2658 791.7052 875.2202 888.8170 968.3552 970.5946 994.7688 1011.6655 1041.7061 1064.8430 1073.9811 1085.4433 1107.0718 1122.1714 1176.4556 1191.5519 1239.2017 1239.8883 1279.6449 1291.9960 1292.5495 1297.4396 1337.0328 1358.5751 1365.7960 1389.5823 1422.0547 1464.3608 1466.2411 1473.2707 1476.3806 1481.4828 1489.1426 1666.9967 2954.0171 2959.3328 2964.3089 2970.0312 2973.3207 2991.5559 2995.3127 3003.7592 3008.7249 3032.6724 3059.2519 3069.7317 3073.3875
redmass: 2.8240 6.5085 4.0527 2.7937 2.1887 1.9420 4.8493 2.0675 5.5131 6.8690 1.1508 5.5927 5.2443 10.4505 4.3712 9.3327 3.3421 7.9208 2.6596 13.4582 1.0818 1.1484 7.2783 1.3021 1.3508 1.9336 4.9804 1.7604 2.7331 3.8252 4.6510 3.5927 2.7144 2.2436 1.4824 2.9866 4.2487 1.6410 1.3399 1.3680 1.1087 1.2418 1.2361 1.0937 1.5162 1.6318 1.6730 1.2172 1.0882 1.0693 1.0757 1.0694 1.0424 1.0786 1.0910 10.3586 1.0591 1.0590 1.0606 1.0593 1.0363 1.0979 1.0599 1.0963 1.1013 1.1043 1.1036 1.1008 1.0993
irintensity: 2.4016 0.1774 0.9113 1.0693 1.3515 0.5929 0.6983 0.3954 4.9336 0.9290 0.0048 2.0936 0.6090 3.5144 13.2980 1.8595 0.4952 0.3262 0.1899 17.4064 17.1647 0.0662 24.5881 10.1192 4.2484 1.1925 120.7141 89.1847 124.8737 3.3666 74.0144 52.5837 28.2257 13.5931 7.3977 58.6886 67.2283 0.0151 2.1357 4.0357 0.2716 3.9038 3.5107 0.4063 5.9825 4.3375 7.4170 10.8249 41.0537 0.1339 0.9548 3.2906 12.8465 3.0124 24.2763 89.1695 3.4305 8.8411 14.1732 87.4790 33.9255 1.3977 29.5064 1.4439 0.1966 37.5980 47.5942 103.1154 51.0222
temp: 298.150 k
press: 1.00000 atm
elementType: 9 9 9 8 6 6 6 6 6 6 6 6 1 1 1 1 1 1 1 1 1 1 1 1 1
symmnumber: 1
zpe: 519658.6 jmol-1
zpe.correction: 0.197928 hartree
zpe.thermalcorrener: 0.212200 hartree
zpe.thermalcorrenthalpy: 0.213144 hartree
zpe.thermalcorrgfe: 0.154174 hartree
zpe.sumelectzpe: -686.425109 hartree
zpe.sumelectthermal: -686.410836 hartree
zpe.sumelectthermalent: -686.409892 hartree
zpe.sumelectthermalfe: -686.468862 hartree
dipole: -3.3535 -1.4914 -0.0094
dipole: 3.6702
quadrupole: -81.6900 -77.5238 -70.7017
quadrupole: -1.5906 -0.0111 0.0292
quadrupole: -5.0515 -0.8853 5.9368 -1.5906 -0.0111 0.0292
hfenergy: -686.6230361 hartree
pointgroup: C01[X(C8H13F3O1)]
dipole: -1.3261279 -0.5631875 0.0962211 debye
dipolederiv: -0.4246014 0.0927637 0.0356604 0.0501215 -0.5748143 -0.2862204 -0.0124772 -0.2412544 -0.5362888 -0.4264048 0.0822011 -0.0740879 0.0618711 -0.400078 0.2342565 -0.0173168 0.1877614 -0.7082396 -0.8500075 -0.261686 0.0573973 -0.198149 -0.4270212 0.0335093 0.0469047 0.0346932 -0.2705469 -0.5320315 -0.0192669 0.0063448 -0.1201086 -0.7100758 0.0775043 0.0218369 0.0754497 -0.2356564 -0.04009 0.01261 0.0016708 0.024882 0.0990513 0.0098816 -0.000576 0.0098947 0.1897241 0.0158937 -0.0193037 0.0043349 -0.0168144 0.0618804 0.0135781 0.0070092 0.015937 0.1566007 -0.0450372 -0.0172547 0.0050027 -0.0541019 0.0730315 0.0134228 0.0087853 0.0126779 0.1784577 -0.356599 -0.1459467 0.0258906 -0.3044486 -0.2280998 0.0552202 0.0418684 0.0475438 0.1140879 0.0267702 0.008971 0.0009034 0.060897 0.1044074 0.007356 -0.0053439 0.0078923 0.1748615 -0.0781545 0.0368831 -0.0022754 -0.0004588 0.0535992 0.0049432 0.0022557 0.0046754 0.0943912 0.9163493 0.1165191 -0.0246625 0.1753374 0.847954 -0.1322326 -0.0313107 -0.130648 0.0347877 1.3621036 0.1552376 -0.0260874 0.1636139 1.2621084 0.039529 -0.0280099 0.0409742 1.5051381 0.0368982 0.0077796 0.0100935 0.0081206 -0.0694497 -0.1150848 0.0157927 -0.1372496 -0.0589819 0.0361458 0.0087309 -0.0157061 0.0069075 -0.0116148 0.1033814 -0.0205415 0.1257785 -0.1156409 0.0480431 0.0063949 -0.0086208 0.0124945 0.0180751 0.0858095 0.00049 0.0948214 -0.0819791 0.0451327 0.0057299 0.0045692 0.0086304 -0.0319368 -0.1001357 -0.0064497 -0.1100633 -0.0356189 0.0361088 -0.0038362 -0.0005577 0.0052631 -0.071023 -0.1164964 0.0017568 -0.1396899 -0.0584216 0.0360968 -0.0009387 -0.0017954 0.0070423 -0.0136263 0.1057025 -0.0062458 0.1291226 -0.1155684 0.0776955 -0.0124636 0.0246329 0.0743527 0.0504252 -0.0762101 0.0307709 -0.095789 0.0319097 0.0726967 -0.0136653 -0.0238937 0.0687356 0.091756 0.0572954 -0.0497274 0.0823492 -0.0088336 0.0257117 0.025749 -0.036647 0.0009252 -0.0143334 0.11245 -0.011978 0.1413292 -0.1201623 0.0268354 0.0300068 0.0274461 0.0007032 -0.0767072 -0.1228243 0.0092404 -0.15232 -0.0588032 0.0768015 0.0080942 0.013854 0.0502758 0.0164982 0.1091832 -0.0401149 0.1235608 -0.1173215 0.0774626 0.0003692 -0.019311 0.0544874 -0.044719 -0.1284247 0.0230878 -0.1415082 -0.0566756 -0.1638195 -0.1036784 0.0158443 -0.1405799 -0.0052874 0.0146059 0.0202928 0.0140609 0.0987802 unknown
polarizability: 112.0705087|1.8426477|86.0158343|-0.7778893|-2.0184685|72.9148142 unknown
InChI: InChI=1S/C8H13F3O/c1-2-3-4-5-6-7(12)8(9,10)11/h2-6H2,1H3
charge 0 multiplicity 1
25 atoms
F  3.098543 -1.309912 -0.998991
F  3.141226 -0.911093 1.242094
F  4.165804 0.523222 -0.189405
O  1.716816 1.740893 -0.331722
C  -2.107307 -0.464001 0.051488
C  -0.869374 0.451134 -0.075061
C  -3.43894 0.316315 -0.022136
C  0.446249 -0.344527 0.006581
C  -4.683727 -0.592349 0.097538
C  -6.010252 0.193805 0.020946
C  1.687111 0.510078 -0.137917
C  3.03905 -0.278825 -0.024929
H  -2.087811 -1.22845 -0.75343
H  -2.063147 -1.020204 1.011375
H  -0.90659 1.003988 -1.033232
H  -0.885633 1.218566 0.722492
H  -3.464387 1.078443 0.784347
H  -3.48561 0.87552 -0.979806
H  0.482835 -1.132582 -0.775607
H  0.51922 -0.89784 0.966741
H  -4.637419 -1.149891 1.055377
H  -4.657315 -1.354582 -0.707794
H  -6.097333 0.731911 -0.941816
H  -6.073589 0.94485 0.830914
H  -6.884219 -0.476666 0.113155
