program: Gaussian 09
title: 000095901
version: EM64L-G09RevD.01
frameworkgroup: C1[X(C8H13NO2)]
method: RPBEPBE
basis: SDD
operation: Freq
keyword: #p
keyword: freq=noraman
keyword: PBEPBE/SDD
title: #p freq=noraman PBEPBE/SDD
converged: YES YES NO NO
title: Mulliken charges:
elementType: O O N C C C C C C C C H H H H H H H H H H H H H
charge: -0.256328 -0.251114 -0.091171 -0.412915 -0.418079 -0.396909 -0.506436 0.267334 -0.373581 -0.026224 -0.550580 0.216291 0.241415 0.240585 0.214355 0.256833 0.181406 0.247932 0.263730 0.222599 0.238331 0.251590 0.222695 0.218241
chargesum: 0.00000
title: Mulliken charges with hydrogens summed into heavy atoms:
elementType: O O N C C C C C C C C
charge: -0.256328 -0.251114 -0.091171 0.044791 0.036861 0.041330 0.005226 0.267334 0.087349 0.225366 -0.109645
polarizability: 1.39716802e+02 9.46012957e+00 8.71001224e+01 4.86863077e+00 -1.83063622e+00 7.38785085e+01
1716.lowfreq: -16.6263 -8.8505 -0.0004 -0.0002 0.0002 5.5680 18.9677 37.6249 47.5048
frequency: 13.8938 37.1859 47.2937 63.4970 101.0511 124.3575 135.7866 231.7870 273.0879 296.6610 342.4823 373.5232 425.7738 482.6092 567.5787 630.3072 678.9413 718.2819 786.2227 805.0919 812.8441 843.7903 915.9482 929.4001 961.8480 969.7297 975.3840 990.4272 1016.4314 1053.3642 1061.2897 1078.1068 1082.9072 1121.2491 1128.5915 1144.6927 1159.8755 1189.9707 1250.3795 1258.3703 1272.9384 1281.5741 1305.1241 1344.9693 1376.9193 1427.5711 1440.9675 1450.4578 1452.6145 1467.0596 1478.9022 1636.5221 1660.5607 2892.5081 3002.6499 3019.1918 3050.8046 3051.3432 3062.3547 3072.8416 3091.1196 3108.5871 3128.9245 3164.5028 3181.7031 3201.2809
redmass: 2.9415 4.1258 5.2016 3.0925 2.7392 3.1673 2.4691 3.2831 4.7908 4.1272 2.4222 2.3163 2.5281 2.5448 2.9686 2.5658 2.8236 3.0807 1.6029 1.7581 1.8816 3.7798 3.2177 1.6520 1.3418 1.3256 1.8751 1.9964 1.2109 1.7622 1.3397 1.6149 2.1246 1.7108 2.2074 1.6855 2.0815 1.3537 1.1474 2.2965 1.4428 1.2407 1.4306 1.2498 1.5370 1.1578 1.0809 1.1373 1.0876 1.1242 1.1305 9.3093 4.6115 1.0707 1.0622 1.0608 1.0569 1.0854 1.0616 1.0965 1.0608 1.1014 1.0973 1.1140 1.1151 1.1144
irintensity: 1.6124 0.5912 0.9234 0.4385 0.5324 3.4591 4.0829 3.9646 5.4306 10.8899 1.8643 10.2562 8.7774 0.2334 2.6695 14.1825 1.2808 12.6555 8.1853 1.3927 4.0253 11.0907 59.1736 53.6681 71.9811 1.5461 51.1372 42.3889 20.4197 28.1855 7.1235 35.2892 4.8961 14.1327 213.7513 49.5295 0.0998 5.6839 8.2203 5.0163 44.4964 2.3582 49.7965 4.0214 67.3818 11.6303 19.5855 21.6749 9.3279 0.2903 10.0942 161.6189 3.5410 68.9834 10.1662 27.8847 19.9646 11.6000 33.8763 23.0382 8.0991 6.3019 7.5721 1.8687 42.7111 22.2722
temp: 298.150 k
press: 1.00000 atm
elementType: 8 8 7 6 6 6 6 6 6 6 6 1 1 1 1 1 1 1 1 1 1 1 1 1
symmnumber: 1
zpe: 518605.1 jmol-1
zpe.correction: 0.197526 hartree
zpe.thermalcorrener: 0.209975 hartree
zpe.thermalcorrenthalpy: 0.210920 hartree
zpe.thermalcorrgfe: 0.155850 hartree
zpe.sumelectzpe: -516.901246 hartree
zpe.sumelectthermal: -516.888796 hartree
zpe.sumelectthermalent: -516.887852 hartree
zpe.sumelectthermalfe: -516.942922 hartree
dipole: -0.1173 -1.1541 1.2858
dipole: 1.7318
quadrupole: -53.6937 -70.1283 -65.8635
quadrupole: 2.6230 3.7853 -2.4351
quadrupole: 9.5348 -6.8998 -2.6350 2.6230 3.7853 -2.4351
hfenergy: -517.0987718 hartree
pointgroup: C01 [X(C8H13N1O2)]
dipole: 0.0347767 0.037901 0.6793887 debye
dipolederiv: -1.5793141 -0.217034 -0.2695859 -0.1383297 -0.4463086 -0.157411 -0.4604132 -0.1273452 -0.5454924 -0.7355098 0.120821 0.0158307 -0.1504895 -0.7528325 -0.3059989 -0.2426888 -0.2568043 -0.5020088 -0.7931909 0.0647886 0.1599194 0.0376432 -0.2586228 0.1322177 0.2012344 0.1273297 -0.2000778 0.1361041 -0.0448144 0.022436 -0.0575373 0.1264296 -0.1054485 -0.0313877 -0.1172804 0.0768874 0.1300664 -0.065441 -0.0533987 -0.0587786 0.19439 -0.0681732 -0.0637135 -0.0634763 0.0065551 0.5588466 -0.1059618 -0.0474495 -0.0735305 0.2457647 -0.0556337 0.0292043 -0.1081784 0.2115196 -0.3415355 0.0803628 -0.0294099 0.2536149 -0.1043277 -0.0467931 -0.1341977 -0.0142926 0.0814609 1.6683313 -0.0358573 0.3159754 0.2409366 0.9239156 0.4942191 0.7682159 0.4706247 0.6387844 0.8595762 0.0474029 0.0336192 -0.2286727 0.2656383 -0.0434511 -0.0583366 -0.0806712 0.2832081 -0.0943991 0.1343727 -0.0083998 0.1587385 -0.1567721 0.0752737 -0.0709797 0.0219065 0.0587898 -0.2202979 0.1253253 -0.0094643 0.1410097 -0.2752927 0.0359147 0.0499167 0.053454 0.1288591 0.0285489 0.0154957 -0.0390992 -0.0767416 -0.1516248 0.0087469 0.0025528 0.0366883 0.0966529 -0.0825587 0.0185301 -0.1031862 0.0302745 0.0457707 0.0378384 -0.133994 0.0218124 0.032365 0.0723409 0.0667778 0.0183197 0.1073389 -0.0711539 -0.0774171 0.0457812 -0.0503663 0.0232912 0.074622 0.0748531 -0.0528526 0.0424459 0.0042764 0.1139207 -0.0094175 0.0470776 -0.1023436 0.0324546 0.0226579 0.0322448 0.0284648 0.0413157 -0.0677222 0.0360878 -0.072544 -0.0677817 -0.0594402 -0.034781 0.0401767 0.0419795 -0.1485959 0.1041774 -0.0363166 0.1734434 -0.0415387 0.0678851 0.0233196 0.0116668 -0.0369686 0.0827812 -0.0550773 0.0140915 -0.0775662 -0.0567438 0.0778268 -0.0043588 0.0146285 -0.0634745 0.0139588 0.0623238 0.0438476 0.0792198 0.0504819 -0.0364834 -0.0121014 -0.0747475 -0.0162874 0.0920094 -0.0786147 -0.0443647 -0.0166287 -0.0713002 -0.0225705 -0.083428 0.0257838 0.0629229 -0.0703457 0.0505999 0.0758905 -0.0044212 0.0858206 0.1116069 -0.0583645 -0.0593449 -0.0812787 0.1093008 -0.0405755 -0.0123414 -0.0153983 -0.0588707 0.0451925 -0.0763801 0.083392 -0.1032334 0.1443902 0.0225466 0.0998359 0.0346379 -0.0381534 0.1018977 -0.056185 -0.0270545 -0.0600467 0.1459354 -0.0354628 -0.0685072 -0.0612211 -0.090365 unknown
polarizability: 139.8757098|9.5525483|79.8992257|3.2276945|6.9922115|80.9204973 unknown
InChI: InChI=1S/C8H13NO2/c1-2-7-11-8(10)3-4-9-5-6-9/h2H,1,3-7H2
charge 0 multiplicity 1
24 atoms
O  1.548955 0.271789 0.825651
O  0.772934 -1.376181 -0.633819
N  -3.111612 0.568316 -0.472696
C  -4.460381 -0.100864 -0.406119
C  -3.9350 0.680733 0.789681
C  -1.934903 -0.340058 -0.396738
C  -0.71525 0.474179 0.068194
C  0.571459 -0.327978 0.024138
C  2.899028 -0.396257 0.835955
C  3.732188 0.044358 -0.339492
C  4.881209 0.754468 -0.221648
H  -4.492753 -1.195656 -0.313102
H  -5.231133 0.331703 -1.05112
H  -4.324036 1.679291 1.01078
H  -3.618294 0.0981 1.666947
H  -1.746331 -0.744486 -1.406605
H  -2.096339 -1.209336 0.286284
H  -0.859798 0.880204 1.085065
H  -0.600056 1.350423 -0.599679
H  3.339007 -0.083535 1.795417
H  2.732261 -1.489081 0.817273
H  3.364989 -0.263339 -1.327472
H  5.474096 1.0357 -1.098869
H  5.265561 1.071207 0.756273
