program: Gaussian 09
title: 000095899
version: EM64L-G09RevD.01
frameworkgroup: C1[X(C13H12N4O3)]
method: RPBEPBE
basis: SDD
operation: Freq
keyword: #p
keyword: freq=noraman
keyword: PBEPBE/SDD
title: #p freq=noraman PBEPBE/SDD
converged: YES YES NO NO
title: Mulliken charges:
elementType: O O O N N N N C C C C C C C C C C C C C H H H H H H H H H H H H
charge: -0.289697 -0.226301 -0.224421 -0.362979 0.000208 -0.063039 0.027742 0.287391 0.224416 -0.344322 -0.347415 -0.245023 -0.370083 0.181662 -0.226084 -0.276271 0.353871 -0.250578 -0.410693 -0.533814 0.264280 0.243452 0.233269 0.256179 0.230827 0.278546 0.290538 0.305527 0.291209 0.226951 0.227029 0.247622
chargesum: 0.00000
title: Mulliken charges with hydrogens summed into heavy atoms:
elementType: O O O N N N N C C C C C C C C C C C C C
charge: -0.289697 -0.226301 -0.224421 -0.057451 0.000208 -0.063039 0.027742 0.287391 0.224416 -0.080041 -0.103963 -0.011754 -0.113904 0.181662 0.004743 0.002275 0.353871 0.039960 -0.119484 0.167788
polarizability: 5.13458958e+02 -7.46985219e+00 1.99474039e+02 1.07391549e-01 4.13215794e-01 7.32989152e+01
1716.lowfreq: -7.8175 -0.0007 0.0006 0.0007 0.7045 2.6868 20.6058 35.2102 39.4224
frequency: 20.2380 35.2085 39.4121 73.6179 79.4080 98.7734 116.8700 141.9937 171.9682 196.8118 237.3032 242.8446 258.2307 258.8622 285.6525 335.9353 346.5783 387.8375 424.7289 466.9555 478.7228 492.3709 506.7253 531.5409 542.1889 576.6184 612.5670 643.8888 666.3570 667.3502 683.2010 741.9579 753.2243 761.3118 762.6533 773.6306 829.7268 853.9482 860.3506 900.1272 947.8526 951.9168 958.7004 978.5080 987.5335 988.1291 1001.3220 1042.4343 1077.0536 1100.3478 1113.4771 1121.2135 1128.1093 1152.0420 1174.8910 1207.9922 1221.3104 1239.2822 1249.5149 1292.0978 1299.9333 1324.8825 1345.8973 1373.9745 1390.1096 1409.8507 1431.0555 1441.8774 1450.4799 1468.0846 1468.4998 1483.3453 1532.0042 1555.4796 1562.1296 1589.0462 1594.0536 1608.5998 2968.0544 3042.2069 3059.2339 3129.7828 3137.1518 3151.3557 3165.5302 3172.7120 3175.6847 3178.7360 3201.1579 3387.7218
redmass: 5.7450 6.9919 6.3068 6.8398 5.6347 3.2644 6.1410 5.0735 7.4675 2.5082 1.6803 7.2120 3.6511 2.8694 4.6909 4.0020 5.7624 7.6420 3.9765 6.4567 3.1823 2.7248 7.2410 6.4681 3.5040 5.9753 7.9263 6.3907 2.1753 7.6724 2.0791 3.6315 6.3608 1.3283 4.6074 8.1255 5.5883 1.4640 1.4230 3.9511 1.3745 1.4251 1.4906 3.5896 1.3449 8.7172 1.3200 2.0510 4.4126 2.1531 1.2575 2.5385 1.6214 1.3901 1.1030 1.9448 6.4836 2.6147 1.7030 1.6859 1.5379 1.7287 7.5742 5.7229 6.4295 3.6912 1.4340 2.4228 1.8268 1.3240 1.0601 1.6918 2.7740 6.2926 6.1697 6.3519 6.3727 6.4708 1.0325 1.0884 1.1043 1.1000 1.0858 1.0898 1.0941 1.0929 1.0998 1.0903 1.0971 1.0749
irintensity: 0.0001 0.2534 0.2808 0.6487 4.0438 3.5594 2.3634 0.0296 0.2016 8.7157 17.6395 1.6850 5.4097 3.4623 5.3284 0.7828 17.7108 20.1831 2.6600 0.7793 11.1769 11.5607 6.6388 10.6129 0.1439 8.4064 2.0663 5.5717 71.7173 2.4731 15.1423 1.0092 22.7230 101.7055 2.3164 2.2048 1.0460 40.9549 0.4047 4.8434 3.4038 12.2534 28.7044 17.1811 1.1514 56.3784 0.4897 10.6991 125.4472 57.9875 0.1161 28.0321 111.2031 6.6142 47.0148 87.5461 1296.0252 74.2217 24.8600 10.9780 48.9135 34.1992 82.9559 17.0623 78.8163 105.8619 34.0648 74.5752 30.5116 89.5386 17.7404 8.9069 150.4565 13.0199 17.3933 2.9790 886.0780 61.0970 91.9651 31.3633 42.0639 18.0896 0.0807 7.3900 18.0243 0.3122 27.6426 1.0609 1.0369 28.6168
temp: 298.150 k
press: 1.00000 atm
elementType: 8 8 8 7 7 7 7 6 6 6 6 6 6 6 6 6 6 6 6 6 1 1 1 1 1 1 1 1 1 1 1 1
symmnumber: 1
zpe: 621400.5 jmol-1
zpe.correction: 0.236679 hartree
zpe.thermalcorrener: 0.254242 hartree
zpe.thermalcorrenthalpy: 0.255186 hartree
zpe.thermalcorrgfe: 0.189001 hartree
zpe.sumelectzpe: -945.714530 hartree
zpe.sumelectthermal: -945.696967 hartree
zpe.sumelectthermalent: -945.696023 hartree
zpe.sumelectthermalfe: -945.762208 hartree
dipole: -11.0326 -1.1430 -0.0102
dipole: 11.0917
quadrupole: -135.6661 -105.6682 -119.2243
quadrupole: 4.5700 -0.2778 -0.0894
quadrupole: -15.4799 14.5180 0.9619 4.5700 -0.2778 -0.0894
hfenergy: -945.9512093 hartree
pointgroup: C01 [X(C13H12N4O3)]
dipole: -4.3109088 0.6441409 -0.2096953 debye
polarizability: 512.6595991|-6.452126|199.242647|19.1521533|-5.2640805|74.3296669 unknown
InChI: InChI=1S/C13H12N4O3/c1-20-12-5-3-2-4-10(12)8-15-16-13-7-6-11(9-14-13)17(18)19/h2-9,16H,1H3
charge 0 multiplicity 1
32 atoms
O  -4.177059 1.883424 -0.347901
O  6.260846 -1.803057 0.247329
O  6.812206 0.417708 0.208044
N  0.579693 1.006834 -0.062852
N  -0.494811 0.143143 -0.083136
N  2.829944 1.531946 0.017017
N  5.945186 -0.545922 0.199445
C  -2.900462 -0.141734 -0.178276
C  -4.186635 0.48248 -0.275576
C  -2.843659 -1.560553 -0.103289
C  -5.366733 -0.297894 -0.295703
C  -4.014918 -2.34002 -0.123507
C  -1.697372 0.68831 -0.156923
C  1.880788 0.536552 0.004917
C  -5.276372 -1.705124 -0.219577
C  2.193982 -0.856085 0.055548
C  4.526246 -0.19693 0.13242
C  3.542409 -1.220554 0.120159
C  4.130157 1.162471 0.079927
C  -5.463593 2.578907 -0.445457
H  -1.857408 -2.028945 -0.028018
H  -6.34966 0.175568 -0.370235
H  -3.950881 -3.431121 -0.064923
H  -1.847564 1.780802 -0.20378
H  -6.193758 -2.3036 -0.235308
H  1.388397 -1.591685 0.042191
H  3.857133 -2.26656 0.161031
H  0.469461 2.032895 -0.098392
H  4.88134 1.95699 0.08931
H  -6.095594 2.378176 0.440535
H  -6.005812 2.28966 -1.365925
H  -5.208798 3.647818 -0.485494
