program: Gaussian 09
title: 000095902
version: EM64L-G09RevD.01
frameworkgroup: C1[X(C14H14N4O3)]
method: RPBEPBE
basis: SDD
operation: Freq
keyword: #p
keyword: freq=noraman
keyword: PBEPBE/SDD
title: #p freq=noraman PBEPBE/SDD
converged: YES YES NO NO
title: Mulliken charges:
elementType: O O O N N N N C C C C C C C C C C C C C C H H H H H H H H H H H H H H
charge: -0.289968 -0.226689 -0.224960 -0.362955 0.000241 -0.063370 0.027600 0.265082 0.246661 -0.346443 -0.352086 -0.243366 -0.245511 -0.227928 -0.372132 0.181779 -0.683862 -0.276583 0.353620 -0.250617 -0.410802 0.263961 0.248395 0.214186 0.213967 0.232986 0.230274 0.254767 0.278581 0.214106 0.232309 0.232282 0.290403 0.305070 0.291003
chargesum: 0.00000
title: Mulliken charges with hydrogens summed into heavy atoms:
elementType: O O O N N N N C C C C C C C C C C C C C C
charge: -0.289968 -0.226689 -0.224960 -0.057884 0.000241 -0.063370 0.027600 0.265082 0.246661 -0.082483 -0.103692 0.184788 -0.012525 0.002346 -0.117365 0.181779 -0.005166 0.001998 0.353620 0.039785 -0.119798
polarizability: 5.25484445e+02 -2.21317174e+01 2.19074351e+02 2.18187836e-02 4.54178684e-02 8.22552907e+01
1716.lowfreq: -3.7961 -3.6484 -0.0003 0.0004 0.0006 6.7739 17.9581 35.0894 36.7103
frequency: 17.8848 35.0893 36.7090 69.0196 74.4418 78.7110 92.5291 117.3731 149.3305 160.6347 200.8394 209.5239 241.3785 244.2867 253.5072 283.2446 322.0854 334.8562 339.8846 396.6566 424.5065 462.2276 480.9492 492.1614 507.5765 542.0985 548.8779 593.0924 613.1820 649.7272 666.2524 667.4263 683.1998 742.3154 758.5574 760.7654 762.4324 773.0770 827.0736 828.0045 853.7335 864.6672 896.5352 909.5738 949.4659 951.6824 959.9007 978.3536 987.8804 1000.9023 1034.3950 1044.6633 1076.0562 1099.5250 1115.0724 1122.4412 1128.1561 1136.6387 1175.1963 1204.1907 1220.4883 1237.8711 1248.8157 1265.2591 1293.7774 1300.8869 1324.1149 1344.7945 1366.7491 1375.8941 1389.3950 1402.3811 1409.8488 1440.8482 1442.0554 1463.3518 1471.7940 1481.4559 1493.0589 1531.4407 1555.2834 1561.7363 1587.3147 1593.3510 1607.9230 2962.8428 2998.2592 3023.1624 3041.4735 3095.7051 3106.8896 3136.2163 3151.4576 3166.9432 3173.0823 3176.3557 3178.4594 3201.1235 3386.7072
redmass: 6.0989 5.8929 6.6800 4.0469 6.3535 4.3792 5.1615 2.0269 4.8847 5.9556 5.4577 3.9387 7.0745 1.3761 2.7941 5.8378 4.3325 4.2273 5.4207 6.3908 3.9743 5.8386 3.1892 2.7231 7.0344 3.5058 7.0194 6.4690 8.0922 6.4537 2.1591 7.7060 2.0929 3.6433 5.7352 1.3062 4.9093 6.4367 5.4477 1.1128 1.4625 1.3808 3.7914 3.5651 1.3743 1.4257 1.4845 3.5853 1.3398 1.3203 2.7496 2.0952 4.4931 2.2280 2.4255 2.3644 1.6175 1.4354 1.0988 2.1209 6.1105 2.5552 1.6918 1.1395 1.6831 1.5127 1.7427 7.5999 1.6371 3.1464 4.9524 1.2947 3.7275 2.5029 2.4082 1.0400 1.7285 1.1958 1.2023 2.8013 6.2824 6.2171 6.2435 6.3993 6.3892 1.0555 1.0363 1.1078 1.0883 1.0988 1.1017 1.0859 1.0900 1.0943 1.0928 1.0991 1.0903 1.0971 1.0749
irintensity: 0.0164 0.2824 0.2706 1.3970 0.1086 3.0965 0.9926 1.4082 0.4481 1.4432 2.5369 11.3529 1.7382 9.9655 6.8899 5.4706 14.8071 0.6131 4.1535 19.9559 2.6586 1.0250 12.4888 10.3024 7.4767 0.1504 6.1347 12.7252 1.2266 5.1426 71.3281 2.6110 14.5615 0.6102 22.9344 101.3953 4.3963 1.4399 0.7219 1.5680 40.3653 0.2423 5.4135 47.8445 4.4669 11.0869 27.3161 16.1040 1.2143 0.4743 86.2323 9.1740 145.6640 53.7802 42.9342 4.7962 108.8811 4.9130 67.2116 148.8042 1309.2511 94.0983 27.3294 0.0010 20.7512 33.9170 41.0342 83.1231 18.6695 7.8089 79.6388 35.7496 103.4147 95.7014 51.1551 13.0912 62.8204 8.4788 2.0880 149.4356 13.7409 17.6229 0.4696 902.1688 64.5306 59.1672 20.9055 30.3085 31.4246 32.0762 33.9251 0.5906 9.4858 19.7167 0.3219 27.3314 1.0376 1.0230 29.4770
temp: 298.150 k
press: 1.00000 atm
elementType: 8 8 8 7 7 7 7 6 6 6 6 6 6 6 6 6 6 6 6 6 6 1 1 1 1 1 1 1 1 1 1 1 1 1 1
symmnumber: 1
zpe: 694666.0 jmol-1
zpe.correction: 0.264584 hartree
zpe.thermalcorrener: 0.283554 hartree
zpe.thermalcorrenthalpy: 0.284498 hartree
zpe.thermalcorrgfe: 0.214825 hartree
zpe.sumelectzpe: -984.944286 hartree
zpe.sumelectthermal: -984.925316 hartree
zpe.sumelectthermalent: -984.924372 hartree
zpe.sumelectthermalfe: -984.994045 hartree
dipole: -11.2035 -0.6843 0.0035
dipole: 11.2244
quadrupole: -148.1215 -112.0755 -125.4389
quadrupole: 5.9284 -0.0528 -0.0045
quadrupole: -19.5762 16.4698 3.1064 5.9284 -0.0528 -0.0045
hfenergy: -985.2088702 hartree
pointgroup: C01 [X(C14H14N4O3)]
dipole: -4.3873864 0.4763246 -0.158482 debye
polarizability: 526.428135|7.7329405|217.5633138|14.2811843|-3.5755735|82.8226378 unknown
InChI: InChI=1S/C14H14N4O3/c1-2-21-13-6-4-3-5-11(13)9-16-17-14-8-7-12(10-15-14)18(19)20/h3-10,17H,2H2,1H3
charge 0 multiplicity 1
35 atoms
O  -4.064083 1.417054 -0.231582
O  6.605376 -1.56994 0.19936
O  7.00375 0.683475 0.150364
N  0.74356 0.848158 -0.055004
N  -0.271281 -0.085845 -0.061615
N  2.953483 1.524299 -0.003019
N  6.204116 -0.33717 0.152515
C  -2.655483 -0.525568 -0.128429
C  -3.98041 0.018395 -0.18888
C  -2.505722 -1.939041 -0.082796
C  -5.107959 -0.837638 -0.202563
C  -5.404274 2.039974 -0.297075
C  -3.624721 -2.791791 -0.09601
C  -4.925788 -2.236872 -0.156008
C  -1.507915 0.379815 -0.115634
C  2.073681 0.466861 -0.001798
C  -5.189779 3.550188 -0.330881
C  2.481048 -0.901284 0.049148
C  4.764207 -0.085614 0.099555
C  3.851688 -1.173636 0.100363
C  4.276133 1.243783 0.047166
H  -1.489827 -2.343559 -0.037051
H  -6.120918 -0.42903 -0.24915
H  -5.92656 1.684773 -1.208442
H  -5.991647 1.735319 0.592759
H  -3.49035 -3.877498 -0.06043
H  -5.803263 -2.892689 -0.16686
H  -1.729437 1.460578 -0.154175
H  1.726889 -1.689682 0.046715
H  -6.165265 4.067376 -0.375449
H  -4.657008 3.88993 0.573552
H  -4.599882 3.843117 -1.216004
H  4.236661 -2.195912 0.140684
H  0.56417 1.864497 -0.089309
H  4.972211 2.08708 0.046079
